program: Gaussian 09
title: 000178425
version: EM64L-G09RevD.01
frameworkgroup: C1[X(C14H15N3O2S)]
method: RPBEPBE
basis: SDD
operation: Freq
keyword: #p
keyword: freq=noraman
keyword: PBEPBE/SDD
title: #p freq=noraman PBEPBE/SDD
converged: YES YES NO NO
title: Mulliken charges:
elementType: S O O N N N C C C C C C C C C C C C C C H H H H H H H H H H H H H H H
charge: 0.324857 -0.246560 -0.288464 -0.170322 -0.372228 -0.025130 -0.110371 -0.713982 0.130806 -0.346234 -0.149901 0.582673 -0.500656 -0.425485 -0.359153 0.288369 -0.226772 -0.250163 -0.239996 -0.773874 0.307964 0.301240 0.253870 0.260978 0.244809 0.244328 0.318538 0.231571 0.283545 0.229423 0.235928 0.231891 0.255393 0.255821 0.217287
chargesum: 0.00000
title: Mulliken charges with hydrogens summed into heavy atoms:
elementType: S O O N N N C C C C C C C C C C C C C C
charge: 0.324857 -0.246560 -0.288464 -0.170322 -0.053690 -0.025130 0.197593 -0.412742 0.130806 0.168615 -0.149901 0.582673 -0.011519 -0.193914 -0.075609 0.288369 0.002651 -0.014235 -0.008105 -0.045373
polarizability: 2.69678300e+02 -1.94091042e+00 1.75211381e+02 1.85125512e+00 2.53763520e-01 1.43691466e+02
1716.lowfreq: -5.3611 -0.0020 -0.0014 -0.0010 2.8625 6.0911 30.8958 42.0885 43.9822
frequency: 30.6064 42.0708 43.9742 59.1991 63.8035 88.4347 90.7308 109.1980 126.9971 172.5632 177.6966 223.2591 225.4554 235.4948 261.8713 284.7939 328.6519 352.2459 404.6022 431.3884 445.2684 463.9227 502.2674 541.2197 545.0571 589.6661 592.2978 596.4820 615.0440 629.3832 649.0757 691.8310 704.3603 713.6434 773.4116 790.1847 822.1610 841.6168 853.3109 919.3308 930.6463 945.9531 958.0940 975.5634 976.9744 977.6333 991.5960 1000.1443 1012.1826 1024.3422 1039.7337 1044.0820 1070.1373 1087.7884 1147.6345 1164.1947 1174.2685 1176.6441 1180.3417 1195.8399 1208.9661 1211.7516 1236.7505 1259.7398 1290.3713 1295.3527 1319.3849 1323.6806 1356.2541 1363.9716 1388.3333 1388.8733 1445.4650 1449.2360 1466.2585 1466.8795 1478.7398 1485.9050 1489.3665 1555.5824 1582.9898 1593.1317 1612.6133 1617.2248 2982.1643 2999.2414 3014.2872 3024.3158 3035.4785 3072.1299 3095.1209 3097.2439 3110.9809 3117.5782 3131.4905 3144.8511 3156.1154 3168.3455 3532.3813
redmass: 4.1345 5.4973 4.9034 1.2208 4.4157 4.2304 3.7300 3.6832 6.1531 5.4805 2.9308 4.6805 6.0213 4.6888 5.2228 3.6290 5.4832 8.6253 2.8107 4.4000 7.8366 4.4364 4.1124 3.8491 1.8069 5.2387 4.1474 5.1645 6.3671 4.4445 5.8369 4.9188 1.5427 4.4205 4.7873 2.2934 1.4396 4.8172 1.2739 3.6905 1.6046 6.7699 3.6758 2.3487 3.7351 1.6508 4.0816 1.3789 2.4195 2.9156 2.9039 1.6595 1.6704 1.6792 2.3912 2.1655 1.0650 1.1787 2.2854 1.1240 1.1855 1.7839 1.5259 1.9245 1.5441 1.3989 1.3827 1.4989 1.3665 8.7014 1.8655 2.1609 2.1283 1.0665 1.1313 1.1226 1.7754 2.2580 1.0853 7.3018 11.1301 5.8869 5.9111 5.6180 1.0817 1.0362 1.0614 1.0636 1.0865 1.1023 1.0988 1.1056 1.0999 1.0879 1.0872 1.0917 1.0959 1.1012 1.0770
irintensity: 0.2008 0.2813 0.6642 0.0884 6.9088 9.9082 4.7135 6.1295 1.8988 1.4572 6.4206 2.1997 2.7686 1.8815 20.7079 1.4056 15.1789 12.2932 0.1710 8.3763 21.1020 7.3605 13.8453 17.3467 82.5348 8.9699 1.0598 3.2825 1.3290 8.4327 6.4457 7.0116 80.1193 1.6291 3.8818 30.3799 1.8171 5.3015 0.6348 15.6326 1.2042 15.2570 2.3506 0.7699 23.4646 1.3065 0.8672 0.3558 8.7806 4.7789 7.6065 13.8735 0.3658 7.3680 21.7428 49.5474 0.9658 4.4133 31.0758 3.2899 7.7783 17.4595 6.5782 34.9413 72.3738 7.9110 12.6524 43.4467 10.8056 234.1594 38.3919 36.6970 7.7885 30.6129 57.0573 5.1505 233.5170 10.5740 8.4176 313.8943 245.5843 1.3639 0.2501 95.3590 31.5954 8.6478 43.6310 27.6251 5.9690 10.1612 11.7110 20.8816 10.9333 6.4488 2.0300 22.7694 17.3908 20.5886 34.0535
temp: 298.150 k
press: 1.00000 atm
elementType: 16 8 8 7 7 7 6 6 6 6 6 6 6 6 6 6 6 6 6 6 1 1 1 1 1 1 1 1 1 1 1 1 1 1 1
symmnumber: 1
zpe: 709833.6 jmol-1
zpe.correction: 0.270361 hartree
zpe.thermalcorrener: 0.288929 hartree
zpe.thermalcorrenthalpy: 0.289873 hartree
zpe.thermalcorrgfe: 0.221814 hartree
zpe.sumelectzpe: -1253.817146 hartree
zpe.sumelectthermal: -1253.798578 hartree
zpe.sumelectthermalent: -1253.797634 hartree
zpe.sumelectthermalfe: -1253.865693 hartree
dipole: -0.1322 0.9288 3.5031
dipole: 3.6265
quadrupole: -104.7779 -133.8440 -124.2527
quadrupole: 5.4124 -2.7017 -1.1854
quadrupole: 16.1804 -12.8858 -3.2945 5.4124 -2.7017 -1.1854
hfenergy: -1254.0875074 hartree
pointgroup: C01 [X(C14H15N3O2S1)]
dipole: -0.0434974 0.2130874 1.4101193 debye
polarizability: 268.0102874|-12.4861707|176.3711878|3.3182554|3.4265417|144.1996724 unknown
InChI: InChI=1S/C14H15N3O2S/c1-9(18)16-11-12(10-5-3-2-4-6-10)20-14-15-7-8-17(14)13(11)19/h2-6,11-12,16H,7-8H2,1H3
charge 0 multiplicity 1
35 atoms
S  0.71007 -1.938024 -0.819103
O  2.233967 1.841887 1.21088
O  -1.295263 2.517204 -1.368281
N  2.681838 -0.193014 0.207857
N  -0.41203 1.804984 0.665251
N  3.453503 -2.172042 -0.721081
C  0.357384 0.72236 0.059415
C  -0.202893 -0.699924 0.366916
C  1.825406 0.844668 0.542181
C  4.146935 -0.142828 0.498714
C  2.407439 -1.4419 -0.444415
C  -1.687723 -0.914043 0.163284
C  4.665529 -1.395414 -0.285926
C  -2.406826 -1.677026 1.119227
C  -2.370384 -0.412901 -0.975413
C  -1.147909 2.688634 -0.119226
C  -3.785085 -1.931859 0.948798
C  -3.74808 -0.668556 -1.145002
C  -4.459681 -1.428271 -0.187198
C  -1.78299 3.853045 0.627076
H  0.319001 0.885209 -1.037704
H  0.083103 -1.010305 1.387683
H  4.315011 -0.212286 1.587566
H  4.562645 0.814192 0.145231
H  5.246938 -1.112386 -1.1821
H  5.301235 -2.045405 0.337945
H  -0.130573 2.10056 1.603472
H  -1.884082 -2.073881 1.998512
H  -1.840255 0.199416 -1.711763
H  -4.328292 -2.521163 1.69568
H  -4.265826 -0.270287 -2.024219
H  -5.528785 -1.625488 -0.324392
H  -1.568705 4.787457 0.082684
H  -2.879376 3.720302 0.63598
H  -1.431344 3.950083 1.668271
