program: Gaussian 09
title: 000178431
version: EM64L-G09RevD.01
frameworkgroup: C1[X(C23H17N3O2S)]
method: RPBEPBE
basis: SDD
operation: Freq
keyword: #p
keyword: freq=noraman
keyword: PBEPBE/SDD
title: #p freq=noraman PBEPBE/SDD
converged: YES YES NO NO
title: Mulliken charges:
elementType: S O O N N N C C C C C C C C C C C C C C C C C C C C C C C H H H H H H H H H H H H H H H H H
charge: 0.346010 -0.208724 -0.288990 -0.217567 -0.415000 0.004855 -0.104730 -0.706355 0.082623 -0.220555 0.576205 0.339828 -0.034249 -0.430577 -0.358577 -0.335272 0.200489 -0.331376 -0.218592 -0.225823 -0.246135 -0.223563 0.267408 -0.238820 -0.343007 -0.365102 -0.224926 -0.232908 -0.224654 0.313108 0.306572 0.327379 0.232798 0.283054 0.291664 0.256983 0.229832 0.230379 0.236323 0.231693 0.233068 0.272801 0.232711 0.234158 0.231471 0.234088
chargesum: 0.00000
title: Mulliken charges with hydrogens summed into heavy atoms:
elementType: S O O N N N C C C C C C C C C C C C C C C C C C C C C C C
charge: 0.346010 -0.208724 -0.288990 -0.217567 -0.087621 0.004855 0.208378 -0.399783 0.082623 -0.220555 0.576205 0.339828 -0.034249 -0.197778 -0.075523 -0.043608 0.200489 -0.074393 0.011239 0.004556 -0.009812 0.008130 0.267408 -0.005752 -0.070207 -0.132392 0.009232 -0.001436 0.009434
polarizability: 4.27478490e+02 2.66505192e+01 2.85239541e+02 1.73004363e+00 -8.33389969e+00 2.03647796e+02
1716.lowfreq: -1.4334 -0.0008 0.0012 0.0018 5.0735 6.8994 22.0399 23.5485 30.6151
frequency: 22.0191 23.5447 30.4966 31.8518 45.2050 62.8256 85.6695 93.9436 98.5502 125.9144 138.0727 160.7212 168.4295 183.8518 213.1894 239.6902 265.0179 283.4215 309.6943 331.9419 339.8700 390.9229 394.5300 403.4325 405.7971 421.8260 429.9669 439.5047 450.5082 490.2585 516.5138 553.4952 558.4493 572.3344 589.8771 613.3671 614.4449 623.2297 625.6932 644.8307 659.2524 665.7238 686.8336 697.4921 704.5198 705.0501 760.2571 764.5378 772.0124 790.0012 794.1341 813.7887 833.1191 852.4786 857.3251 867.6539 880.0122 904.6104 929.0346 938.7883 955.3128 977.6061 977.9807 986.0244 988.0614 990.2204 991.2670 1000.3943 1006.3578 1011.2656 1020.3579 1024.2584 1035.3269 1071.8006 1084.8373 1088.4144 1098.4712 1148.3345 1155.9893 1160.3734 1171.9885 1174.7157 1175.1029 1183.8835 1190.7792 1197.5258 1213.0077 1222.2309 1247.2541 1266.7560 1287.8073 1298.0119 1317.4108 1322.2656 1338.1004 1357.3701 1386.2007 1388.7547 1394.9631 1432.9226 1436.4470 1446.0957 1456.3115 1463.1122 1464.8484 1486.7499 1487.4712 1572.2191 1592.5790 1593.5545 1601.9107 1607.0390 1612.0622 1612.8496 1620.3196 2965.4648 3032.7223 3119.1842 3126.7494 3132.9224 3135.2387 3138.7330 3145.5160 3147.7730 3156.4258 3157.5305 3159.8030 3169.1406 3171.1409 3175.8748 3199.9625 3527.4809
redmass: 5.8114 4.1259 6.2237 6.6633 4.8219 5.0613 5.9860 7.1380 7.0707 7.0414 6.4794 5.7393 6.2806 5.4136 6.5492 5.0791 6.8625 6.0402 6.1353 4.9633 8.3758 8.7149 7.0206 2.9071 2.9352 7.3392 4.1319 3.8173 4.0228 3.8743 4.5522 1.8622 4.7943 3.8826 6.5028 6.3575 6.3335 7.0767 6.0495 8.2807 6.2014 6.1199 5.2561 4.0599 1.6229 1.5644 3.1384 3.4111 1.8687 2.2546 2.3943 5.9087 5.6119 1.2578 1.2489 7.0004 1.4033 6.4175 1.4449 1.4352 1.3762 3.9243 1.6156 1.4753 1.3065 4.8105 4.6470 1.3577 1.3398 2.0859 3.6876 2.5718 2.4973 2.9886 1.7138 1.7949 2.2781 1.9098 1.5467 1.4451 3.3752 1.0595 1.0669 1.9965 1.2662 1.1287 1.9029 2.8854 1.5881 1.8608 1.4999 2.0621 1.3331 1.3053 7.1007 1.3382 9.2642 5.5295 5.7744 2.2222 2.9137 2.1531 4.7262 3.7446 1.9573 2.2480 2.3503 6.1030 7.6600 6.1853 7.3733 7.1472 6.0044 5.9264 8.5403 1.0805 1.0864 1.0878 1.0860 1.0871 1.0880 1.0866 1.0915 1.0925 1.0959 1.0925 1.0960 1.1013 1.1010 1.0975 1.0959 1.0764
irintensity: 0.2596 0.4404 0.7348 0.2496 0.7537 0.6118 1.4083 10.4356 1.5255 0.0940 1.4369 1.8047 0.2386 3.5491 3.4553 7.0654 2.7317 12.6206 4.4923 15.1603 5.3161 4.9657 3.2421 0.2099 0.4253 15.2376 17.9609 7.5355 0.0999 19.3306 57.1535 44.6793 38.2525 0.4834 0.4170 2.1202 0.8499 2.9945 2.1742 4.9350 10.1658 2.7756 6.4730 1.7578 86.1259 96.8067 19.2597 25.9990 59.5272 23.0071 22.5785 2.4108 6.5267 1.5138 1.4904 4.0642 0.1447 1.2668 6.1724 1.8651 5.1252 16.6767 1.6750 2.3037 0.0735 0.3308 1.5432 0.4069 1.0680 9.2976 15.3633 2.8387 6.8808 8.3866 22.1825 7.1115 2.4297 57.7208 21.7459 51.2336 43.9038 1.1976 1.1477 7.1810 19.4801 5.6050 27.0499 1.4462 12.9637 37.5977 0.3273 112.1653 1.1441 7.7774 467.8192 9.2433 1.6705 2.3582 73.8885 34.8430 234.6546 8.9408 240.9913 60.8953 153.5265 9.1968 102.5579 108.0521 75.2631 11.3699 63.4603 21.9907 8.4105 0.3641 8.7310 61.9609 4.9073 6.1119 4.5781 1.1699 3.3338 4.7757 19.7788 21.3455 18.3776 19.7723 15.8588 21.7011 22.5921 16.5130 3.7454 31.4764
temp: 298.150 k
press: 1.00000 atm
elementType: 16 8 8 7 7 7 6 6 6 6 6 6 6 6 6 6 6 6 6 6 6 6 6 6 6 6 6 6 6 1 1 1 1 1 1 1 1 1 1 1 1 1 1 1 1 1
symmnumber: 1
zpe: 908710.1 jmol-1
zpe.correction: 0.346109 hartree
zpe.thermalcorrener: 0.369557 hartree
zpe.thermalcorrenthalpy: 0.370501 hartree
zpe.thermalcorrgfe: 0.290556 hartree
zpe.sumelectzpe: -1597.453105 hartree
zpe.sumelectthermal: -1597.429657 hartree
zpe.sumelectthermalent: -1597.428713 hartree
zpe.sumelectthermalfe: -1597.508659 hartree
dipole: 2.9780 -1.3626 3.3856
dipole: 4.7104
quadrupole: -154.8655 -169.7555 -170.9504
quadrupole: 7.0284 3.1276 2.6008
quadrupole: 10.3249 -4.5650 -5.7599 7.0284 3.1276 2.6008
hfenergy: -1597.7992143 hartree
pointgroup: C01 [X(C23H17N3O2S1)]
dipole: 1.1692161 0.4156497 -1.3764119 debye
polarizability: 428.9855109|-21.8759089|280.6898486|3.5594695|-17.5857133|206.6904676 unknown
InChI: InChI=1S/C23H17N3O2S/c27-21(16-11-5-2-6-12-16)25-19-20(15-9-3-1-4-10-15)29-23-24-17-13-7-8-14-18(17)26(23)22(19)28/h1-14,19-20,25H
charge 0 multiplicity 1
46 atoms
S  -1.567078 -2.415905 0.83923
O  -1.163338 1.811956 -0.819861
O  2.045249 0.653491 1.914271
N  -2.542812 0.106922 -0.045795
N  1.152916 0.558825 -0.234092
N  -4.145091 -1.43155 0.586991
C  -0.053619 -0.117035 0.229406
C  -0.152739 -1.60918 -0.217318
C  -1.279309 0.688973 -0.260359
C  -2.844553 -1.211497 0.457919
C  1.085642 -2.45824 -0.034311
C  -3.811018 0.737668 -0.254785
C  -4.779751 -0.227057 0.166467
C  1.467138 -3.343944 -1.074771
C  1.847567 -2.42884 1.162641
C  -4.170142 2.007411 -0.739339
C  2.135501 0.946051 0.67905
C  -6.154324 0.073112 0.113107
C  -5.555801 2.294963 -0.785955
C  2.59404 -4.18208 -0.92998
C  2.972972 -3.267863 1.306583
C  -6.529793 1.347912 -0.368904
C  3.2907 1.725346 0.120585
C  3.350187 -4.14633 0.264025
C  4.050533 2.513616 1.022522
C  3.65921 1.681408 -1.249811
C  5.147007 3.26781 0.557651
C  4.760813 2.43332 -1.712366
C  5.502428 3.23313 -0.812006
H  -0.025412 -0.085973 1.340324
H  -0.501716 -1.674509 -1.263579
H  1.089033 1.05828 -1.124979
H  0.877073 -3.379912 -1.999061
H  1.581674 -1.739372 1.970611
H  -3.417864 2.729242 -1.061326
H  -6.893798 -0.664867 0.436203
H  -5.882409 3.273188 -1.154716
H  2.878435 -4.860208 -1.741938
H  3.557931 -3.231147 2.231771
H  -7.591264 1.612212 -0.422971
H  4.224728 -4.795889 0.381009
H  3.763655 2.515039 2.079088
H  3.12119 1.032404 -1.950514
H  5.724748 3.880095 1.258362
H  5.046496 2.388214 -2.768843
H  6.356065 3.817211 -1.173331
