program: Gaussian 09
title: 000178428
version: EM64L-G09RevD.01
frameworkgroup: C1[X(C19H16N4O4S)]
method: RPBEPBE
basis: SDD
operation: Freq
keyword: #p
keyword: freq=noraman
keyword: PBEPBE/SDD
title: #p freq=noraman PBEPBE/SDD
converged: YES YES NO NO
title: Mulliken charges:
elementType: S O O O O N N N N C C C C C C C C C C C C C C C C C C C H H H H H H H H H H H H H H H H
charge: 0.335108 -0.243461 -0.293367 -0.207608 -0.201728 -0.168672 -0.417737 -0.020212 0.028019 -0.104824 -0.738776 0.127942 -0.346378 -0.145907 0.619476 -0.501148 -0.411583 -0.326226 0.198998 -0.361755 -0.381647 0.375546 0.262172 -0.337595 -0.359989 -0.223974 -0.233407 -0.223011 0.312234 0.310843 0.257009 0.263397 0.248432 0.248081 0.334736 0.244223 0.296252 0.287864 0.292793 0.273078 0.229901 0.235259 0.232363 0.235280
chargesum: 0.00000
title: Mulliken charges with hydrogens summed into heavy atoms:
elementType: S O O O O N N N N C C C C C C C C C C C C C C C C C C C
charge: 0.335108 -0.243461 -0.293367 -0.207608 -0.201728 -0.168672 -0.083001 -0.020212 0.028019 0.207411 -0.427932 0.127942 0.174028 -0.145907 0.619476 -0.004635 -0.167360 -0.029975 0.198998 -0.073891 -0.088854 0.375546 0.262172 -0.064517 -0.130088 0.011285 -0.001043 0.012269
polarizability: 3.63892522e+02 -7.39847967e+00 2.56598283e+02 3.02000784e+00 2.32527654e+00 2.11551766e+02
1716.lowfreq: -5.4117 -0.0013 -0.0009 0.0007 2.7848 4.1498 13.0320 23.9805 32.6434
frequency: 12.5808 23.9234 32.6322 34.2531 41.3481 46.1255 66.0954 84.4358 103.2021 111.7447 120.2526 134.3895 152.7004 158.8260 179.1459 194.2584 218.6788 250.7710 273.7238 280.6652 312.1747 329.7746 348.3961 390.8629 399.3101 404.1992 408.9249 438.7694 450.7558 454.4573 490.6524 505.6823 518.1721 573.1708 582.9524 593.0618 613.2825 614.9596 631.9179 658.7084 664.0448 669.1274 685.2810 696.3327 704.7660 715.0128 755.7805 764.1339 784.3680 794.6853 821.6094 837.4967 846.6175 857.6244 867.0313 878.7173 932.8790 939.9037 953.8897 974.5643 983.8750 986.4603 989.5632 989.8957 995.0734 1007.1929 1007.5142 1024.3675 1036.1015 1069.8564 1081.3572 1092.2845 1093.0951 1115.9835 1159.1375 1168.9112 1175.1053 1177.5223 1182.6911 1189.5794 1191.3248 1208.9352 1211.5876 1223.2333 1235.4833 1268.7625 1293.5690 1297.8967 1308.5249 1318.0248 1323.4306 1342.8539 1367.6648 1372.5646 1386.8271 1403.0159 1428.2265 1433.5197 1463.6142 1466.4945 1482.0421 1486.8451 1488.0890 1559.1660 1569.4993 1586.4127 1597.1301 1604.7596 1608.4925 1612.0932 2979.3898 3017.4409 3026.3703 3039.3641 3075.5370 3099.4339 3128.0078 3136.2561 3138.9606 3148.8463 3160.6329 3165.2816 3171.8878 3184.9424 3189.1563 3495.0411
redmass: 6.7566 5.8190 5.8105 5.0431 6.4518 8.1151 6.9506 4.9509 5.7863 5.3382 6.7470 8.0034 6.5242 5.7303 3.1312 7.7920 4.7335 5.8611 5.9256 5.6466 5.3837 6.6477 9.2706 6.6493 4.3926 3.7404 2.9499 5.6228 6.1827 6.0424 4.3414 6.9123 4.6289 2.9124 2.2647 7.0084 6.3169 6.0608 6.3711 6.6799 6.3501 5.1239 4.6296 3.5311 1.7316 4.3569 5.2976 5.0048 7.8241 2.4045 1.4231 4.6071 1.3147 1.2496 1.9192 4.9255 4.1189 1.4367 6.0184 4.5940 1.4068 1.4718 4.5578 1.4794 4.0067 1.3473 2.8504 2.4255 4.5705 1.6808 1.9382 2.8799 2.6419 1.3780 1.5094 3.5240 1.0592 1.2022 2.0127 1.4455 1.2331 1.1832 1.8279 4.7650 1.5077 1.8641 1.4332 1.7136 1.3081 1.3348 1.5745 1.5376 9.1842 5.6060 9.2545 6.5138 2.7492 2.2135 1.7828 1.1674 2.3787 1.8461 1.2335 7.5713 6.6628 8.4791 7.4843 6.1854 6.1272 5.9988 1.0814 1.0612 1.0634 1.0864 1.1028 1.1058 1.0858 1.0881 1.0907 1.0924 1.0961 1.0906 1.1010 1.0945 1.0959 1.0760
irintensity: 0.2394 1.0843 0.1269 0.0405 0.6120 0.4848 0.8513 0.0807 4.7507 11.5844 3.4974 3.4969 0.4600 2.4344 2.3303 4.1777 2.3896 1.7546 25.0804 1.6678 4.3863 14.1104 19.3544 6.2182 3.2787 1.1988 0.6864 16.9001 2.8092 11.5541 15.0293 4.7194 20.3704 30.5100 47.3155 6.8415 3.8995 1.9127 4.1462 6.5353 5.3024 7.0504 22.1900 13.4454 96.0350 10.3949 12.8055 22.3099 28.5116 11.2777 1.8704 3.4594 1.0475 2.1622 59.8910 4.7430 24.9251 1.2296 7.6560 23.1422 1.6394 1.7097 2.9908 0.2508 3.2014 1.0767 5.7627 11.4794 8.9793 0.2853 11.8333 13.1370 9.7189 14.4820 19.1599 87.7590 1.4045 9.2846 16.2711 73.0690 18.7142 3.8030 71.6290 232.6523 8.3698 55.9704 84.4008 41.4603 12.9907 3.6870 52.0143 10.0297 318.6881 92.5427 1.8316 3.7838 35.8265 11.0996 288.5306 9.4335 3.5223 101.8724 29.1002 361.0199 161.5237 142.9857 1.5515 15.8449 32.3384 11.1862 37.6642 39.7781 26.7098 4.6010 8.2592 18.8767 3.9676 3.8635 6.9550 19.8786 15.2104 0.9316 20.5848 1.1627 3.5932 47.6788
temp: 298.150 k
press: 1.00000 atm
elementType: 16 8 8 8 8 7 7 7 7 6 6 6 6 6 6 6 6 6 6 6 6 6 6 6 6 6 6 6 1 1 1 1 1 1 1 1 1 1 1 1 1 1 1 1
symmnumber: 1
zpe: 850580.8 jmol-1
zpe.correction: 0.323969 hartree
zpe.thermalcorrener: 0.348137 hartree
zpe.thermalcorrenthalpy: 0.349081 hartree
zpe.thermalcorrgfe: 0.266332 hartree
zpe.sumelectzpe: -1649.539731 hartree
zpe.sumelectthermal: -1649.515563 hartree
zpe.sumelectthermalent: -1649.514619 hartree
zpe.sumelectthermalfe: -1649.597368 hartree
dipole: 4.5079 4.8970 3.3663
dipole: 7.4588
quadrupole: -173.7622 -183.7648 -162.2259
quadrupole: -20.1233 0.3726 -2.0363
quadrupole: -0.5113 -10.5138 11.0251 -20.1233 0.3726 -2.0363
hfenergy: -1649.8637005 hartree
pointgroup: C01 [X(C19H16N4O4S1)]
dipole: 1.7886988 1.8618076 1.3948409 debye
polarizability: 363.2753177|-10.0646718|256.9270831|6.2616999|2.7724158|211.8401706 unknown
InChI: InChI=1S/C19H16N4O4S/c24-17(13-4-2-1-3-5-13)21-15-16(12-6-8-14(9-7-12)23(26)27)28-19-20-10-11-22(19)18(15)25/h1-9,15-16,21H,10-11H2
charge 0 multiplicity 1
44 atoms
S  2.530449 -2.232594 -0.439264
O  2.919773 2.124186 0.827054
O  -0.535652 1.270702 -1.845052
O  -4.417281 -4.197445 0.905311
O  -4.507216 -3.543679 -1.278102
N  3.932966 0.12934 0.239229
N  0.418205 1.303527 0.280226
N  5.229904 -1.725952 -0.260602
N  -3.9227 -3.601829 -0.128898
C  1.467355 0.365299 -0.109879
C  1.271013 -1.070721 0.465275
C  2.824058 0.94975 0.357619
C  5.319021 0.609809 0.528311
C  4.021333 -1.249441 -0.149795
C  -0.097171 -1.696098 0.28776
C  6.181245 -0.595826 0.0206
C  -0.683825 -2.382312 1.383728
C  -0.786161 -1.652255 -0.953269
C  -0.510886 1.747769 -0.66493
C  -1.938222 -3.008252 1.259686
C  -2.040542 -2.274266 -1.095662
C  -2.598784 -2.943962 0.014404
C  -1.466983 2.811361 -0.210229
C  -2.14312 3.558505 -1.209056
C  -1.731785 3.077338 1.159382
C  -3.053115 4.571605 -0.845303
C  -2.646253 4.08964 1.521374
C  -3.304179 4.842669 0.521025
H  1.458159 0.303669 -1.218058
H  1.554796 -1.094759 1.532085
H  5.431768 0.799232 1.609857
H  5.504131 1.553113 -0.009615
H  6.728367 -0.353546 -0.908196
H  6.917902 -0.928419 0.770273
H  0.654149 1.929236 1.057893
H  -0.152609 -2.427138 2.341211
H  -0.363366 -1.104845 -1.80021
H  -2.406893 -3.538784 2.092216
H  -2.589697 -2.242872 -2.039829
H  -1.940603 3.323459 -2.258982
H  -1.260803 2.47653 1.945929
H  -3.567456 5.147822 -1.62181
H  -2.853081 4.284538 2.579148
H  -4.013609 5.627996 0.804245
