program: Gaussian 09
title: 000178426
version: EM64L-G09RevD.01
frameworkgroup: C1[X(C19H17N3O2S)]
method: RPBEPBE
basis: SDD
operation: Freq
keyword: #p
keyword: freq=noraman
keyword: PBEPBE/SDD
title: #p freq=noraman PBEPBE/SDD
converged: YES YES NO NO
title: Mulliken charges:
elementType: S O O N N N C C C C C C C C C C C C C C C C C C C H H H H H H H H H H H H H H H H H
charge: 0.324900 -0.248255 -0.292942 -0.168806 -0.410708 -0.024852 -0.109942 -0.715100 0.129486 -0.347018 -0.150917 0.586556 -0.501513 -0.429508 -0.356461 0.198713 -0.226574 -0.245952 0.262348 -0.239813 -0.342157 -0.363303 -0.225582 -0.233331 -0.225504 0.309875 0.301437 0.254502 0.260832 0.244859 0.244451 0.330246 0.230964 0.281894 0.228687 0.234941 0.231490 0.272184 0.234088 0.232772 0.230246 0.232766
chargesum: 0.00000
title: Mulliken charges with hydrogens summed into heavy atoms:
elementType: S O O N N N C C C C C C C C C C C C C C C C C C C
charge: 0.324900 -0.248255 -0.292942 -0.168806 -0.080463 -0.024852 0.199933 -0.413663 0.129486 0.168316 -0.150917 0.586556 -0.012202 -0.198545 -0.074567 0.198713 0.002113 -0.011011 0.262348 -0.008322 -0.069973 -0.129215 0.007191 -0.003085 0.007262
polarizability: 3.24361525e+02 2.16995168e+01 2.33842282e+02 1.68397413e+00 -1.05709036e+00 1.95510334e+02
1716.lowfreq: -2.9447 -2.1854 0.0005 0.0007 0.0020 3.6300 21.4557 29.8326 36.0690
frequency: 21.4001 29.7808 36.0601 39.3001 50.0891 70.1713 86.3780 100.2278 112.3016 139.9846 162.2542 173.4947 180.1447 211.9273 225.8942 239.7002 272.4533 291.6888 330.4654 350.2781 394.5399 403.6804 405.5696 431.0278 448.0589 451.5263 489.5368 517.6659 555.3119 576.6897 593.8424 602.5572 614.5606 615.4027 647.5134 665.0624 683.1560 695.8150 703.3590 704.7512 717.0448 766.7058 788.3649 794.4634 821.5689 831.2210 851.9163 857.9685 876.8644 925.8953 933.6068 939.1820 953.4898 975.5526 977.1120 986.2258 989.0242 990.6942 994.9811 999.2964 1005.7155 1023.6199 1024.4933 1037.8950 1070.7108 1079.9024 1086.6463 1095.8998 1157.1011 1169.3554 1174.1305 1174.3145 1177.0963 1182.6806 1190.2654 1196.1575 1209.1286 1210.9467 1239.4198 1268.2122 1292.6247 1298.8830 1317.4697 1320.7209 1324.8202 1356.5723 1367.6041 1386.0379 1388.5628 1433.3722 1445.6068 1465.4728 1467.4293 1486.0468 1487.4748 1489.1383 1556.0805 1570.0924 1584.0514 1593.4117 1604.7384 1612.2107 1612.3273 2981.3287 3014.6237 3025.5026 3035.8517 3071.5767 3096.9202 3117.5373 3126.3339 3131.6181 3134.2917 3145.2094 3146.9546 3157.0937 3159.3379 3169.0923 3170.4008 3504.5945
redmass: 5.3377 4.1712 6.6898 4.5176 5.6528 5.2706 4.5473 7.1360 4.7079 5.7239 4.8352 4.4548 3.6568 5.2745 5.3113 4.9428 6.0378 4.7832 5.8734 9.6558 5.7655 2.8793 2.9438 5.4732 4.6926 6.7940 4.1764 4.6589 6.9654 1.5659 6.9282 5.5368 6.4124 5.9679 6.3603 5.8235 5.1409 4.1022 1.5365 1.6432 4.4596 5.4461 2.2347 2.3872 1.4042 5.1903 1.2577 1.2483 6.3188 1.6391 3.1339 1.4399 5.8583 4.7073 1.4705 1.4440 4.9902 4.5143 4.3975 1.3834 1.3429 3.1732 2.4394 2.7637 1.6767 1.9489 1.6975 2.4455 1.4422 3.5151 1.0587 1.0589 1.1974 2.1685 1.2213 1.1308 1.1812 1.7700 1.4951 1.8409 1.3939 1.8532 1.3329 1.3707 1.4840 1.3337 9.2470 9.3290 5.5581 2.2201 2.1306 1.6488 1.2436 2.2390 2.0164 1.1682 7.2959 7.0163 8.1381 5.8874 6.3290 6.0215 5.9090 1.0812 1.0612 1.0631 1.0864 1.1028 1.1060 1.0877 1.0856 1.0872 1.0882 1.0919 1.0926 1.0958 1.0960 1.1008 1.1008 1.0760
irintensity: 0.1545 0.8271 0.1127 0.5809 0.8376 0.5291 0.7291 7.8965 6.8370 1.2930 1.1652 2.7754 3.1393 0.9044 4.0540 0.5362 26.5542 2.2302 21.9344 15.1768 0.6518 0.1558 0.4506 24.1915 3.3088 6.2556 17.3071 17.8305 20.8141 72.3362 7.0479 3.1911 1.3661 1.1815 5.6612 1.5908 16.4406 1.6930 79.5322 105.1882 3.9121 2.2549 25.6898 22.9938 1.7401 7.4370 1.4243 1.4631 1.1615 17.3404 15.7278 1.2440 7.8563 22.9524 0.6658 1.5050 2.9522 0.3863 2.9467 0.4811 1.0499 3.8618 12.7342 8.4310 0.2388 14.7252 1.5867 8.8049 21.3080 77.9012 1.4054 0.3971 6.2268 14.5360 17.8879 3.9111 5.9834 17.6349 7.0278 41.0807 74.7199 66.8169 0.3817 18.8137 42.0976 10.6260 300.2267 1.7686 1.3491 10.6033 8.9752 250.2822 34.3034 8.3152 135.8547 21.2475 339.8888 167.8047 126.8789 0.9363 21.4364 7.6755 0.5462 39.0806 44.6373 28.2599 5.3623 9.4983 21.1767 6.2222 3.4097 1.9610 3.8487 22.1197 22.8703 19.5501 16.9566 16.8479 22.1013 43.7610
temp: 298.150 k
press: 1.00000 atm
elementType: 16 8 8 7 7 7 6 6 6 6 6 6 6 6 6 6 6 6 6 6 6 6 6 6 6 1 1 1 1 1 1 1 1 1 1 1 1 1 1 1 1 1
symmnumber: 1
zpe: 847658.9 jmol-1
zpe.correction: 0.322856 hartree
zpe.thermalcorrener: 0.344315 hartree
zpe.thermalcorrenthalpy: 0.345260 hartree
zpe.thermalcorrgfe: 0.269885 hartree
zpe.sumelectzpe: -1445.237953 hartree
zpe.sumelectthermal: -1445.216494 hartree
zpe.sumelectthermalent: -1445.215550 hartree
zpe.sumelectthermalfe: -1445.290925 hartree
dipole: 1.5589 -1.0479 3.1973
dipole: 3.7082
quadrupole: -142.7066 -146.7548 -146.3856
quadrupole: 12.7771 -1.8405 3.6261
quadrupole: 2.5757 -1.4725 -1.1032 12.7771 -1.8405 3.6261
hfenergy: -1445.5608097 hartree
pointgroup: C01 [X(C19H17N3O2S1)]
dipole: -0.6142239 -0.1769831 -1.3114288 debye
polarizability: 321.464538|-27.062584|235.5238338|-0.2391179|6.6974622|196.7257689 unknown
InChI: InChI=1S/C19H17N3O2S/c23-17(14-9-5-2-6-10-14)21-15-16(13-7-3-1-4-8-13)25-19-20-11-12-22(19)18(15)24/h1-10,15-16,21H,11-12H2
charge 0 multiplicity 1
42 atoms
S  3.168109 0.970424 0.681303
O  1.010585 -2.589581 -1.155577
O  -1.383795 -0.374353 1.831002
N  2.971908 -1.642031 -0.378757
N  -0.577914 -0.574791 -0.346703
N  5.087094 -0.967306 0.287996
C  0.812602 -0.4665 0.086235
C  1.48842 0.888505 -0.290295
C  1.595445 -1.651061 -0.532967
C  3.830335 -2.788322 -0.805248
C  3.828446 -0.637114 0.184652
C  0.726372 2.15387 0.040416
C  5.217757 -2.383474 -0.200194
C  0.688724 3.199872 -0.91746
C  0.085177 2.341066 1.292453
C  -1.609214 -0.568642 0.59336
C  0.016361 4.409535 -0.637847
C  -0.586324 3.550583 1.571067
C  -2.992966 -0.811765 0.061436
C  -0.623255 4.58802 0.610326
C  -3.983401 -1.244998 0.979958
C  -3.345548 -0.604179 -1.29812
C  -5.300652 -1.491524 0.542721
C  -4.6665 -0.846823 -1.733214
C  -5.644912 -1.296885 -0.816409
H  0.815324 -0.563738 1.191816
H  1.76748 0.889396 -1.358868
H  3.840134 -2.861029 -1.906589
H  3.420617 -3.727773 -0.400812
H  5.504021 -3.028526 0.650108
H  6.02803 -2.429325 -0.94677
H  -0.730458 -1.070343 -1.230873
H  1.189328 3.065663 -1.884584
H  0.081799 1.53839 2.036637
H  -0.006775 5.207823 -1.387793
H  -1.085616 3.679692 2.537316
H  -1.146127 5.525208 0.831505
H  -3.695272 -1.376233 2.028027
H  -2.608459 -0.216553 -2.010738
H  -6.058224 -1.832677 1.256534
H  -4.934836 -0.676675 -2.781556
H  -6.669118 -1.485628 -1.156895
