program: Gaussian 09
title: 000178427
version: EM64L-G09RevD.01
frameworkgroup: C1[X(C19H16N4O4S)]
method: RPBEPBE
basis: SDD
operation: Freq
keyword: #p
keyword: freq=noraman
keyword: PBEPBE/SDD
title: #p freq=noraman PBEPBE/SDD
converged: YES YES NO NO
title: Mulliken charges:
elementType: S O O O O N N N N C C C C C C C C C C C C C C C C C C C H H H H H H H H H H H H H H H H
charge: 0.338857 -0.251923 -0.269416 -0.208605 -0.196864 -0.166896 -0.428007 -0.019596 0.020498 -0.097572 -0.758452 0.127809 -0.346173 -0.149117 0.645256 -0.501635 -0.416823 -0.452670 0.186489 0.372059 -0.189331 -0.382227 0.261141 -0.335400 -0.356569 -0.225352 -0.236026 -0.224441 0.316883 0.305717 0.257571 0.263345 0.248870 0.247731 0.343304 0.305244 0.241248 0.239169 0.289176 0.276366 0.225436 0.235365 0.231119 0.234445
chargesum: 0.00000
title: Mulliken charges with hydrogens summed into heavy atoms:
elementType: S O O O O N N N N C C C C C C C C C C C C C C C C C C C
charge: 0.338857 -0.251923 -0.269416 -0.208605 -0.196864 -0.166896 -0.084703 -0.019596 0.020498 0.219311 -0.452735 0.127809 0.174743 -0.149117 0.645256 -0.005034 -0.111580 -0.211422 0.186489 0.372059 0.049838 -0.093051 0.261141 -0.059035 -0.131133 0.010014 -0.004907 0.010003
polarizability: 3.51971584e+02 1.16055492e+01 2.59105273e+02 9.24269460e+00 -2.41748319e+01 2.04082213e+02
1716.lowfreq: -7.4851 -4.5716 -0.0011 0.0012 0.0012 5.8054 20.7555 25.0618 26.6884
frequency: 20.7421 25.0184 26.5241 33.3688 37.1034 47.9236 67.3991 80.7712 94.2101 108.6540 116.7371 146.4391 162.7359 173.3026 178.8287 212.6655 216.7083 237.3947 266.9951 275.8235 282.4100 337.2719 357.4779 378.2117 397.4508 403.5283 419.7455 427.3930 450.0651 459.1310 499.2833 502.6267 534.0128 561.1065 592.9462 602.0891 607.5703 616.5296 640.2308 663.0431 668.0027 681.5397 689.6831 697.8738 704.6346 715.2150 740.6036 756.2427 781.2041 796.0981 819.4236 821.0670 857.8689 874.3756 913.0576 926.7749 938.4650 940.2775 947.1031 957.4396 975.1796 987.6731 989.2970 990.2075 994.6535 998.9029 1008.5519 1024.3244 1032.7734 1069.7339 1080.4648 1085.8027 1091.2041 1093.8810 1157.9967 1168.9367 1174.6004 1176.6227 1177.5939 1182.3788 1191.9404 1208.2003 1209.3260 1215.0047 1231.9474 1261.8865 1289.1408 1296.1710 1308.3111 1319.2077 1322.8830 1342.7386 1374.3725 1375.7654 1386.3406 1402.7387 1431.9476 1439.1091 1458.3499 1466.4871 1478.0519 1486.4212 1488.1485 1559.1152 1565.9729 1583.3871 1592.5332 1603.9745 1611.7867 1616.5954 2978.1347 3017.7808 3026.7553 3044.5002 3074.8271 3099.2436 3126.3819 3134.3876 3135.2082 3148.0279 3160.0004 3161.2865 3171.3145 3183.0435 3188.3357 3464.0999
redmass: 7.2276 4.9939 4.8391 8.1193 6.1332 8.9313 8.4818 6.0735 4.6418 9.2280 5.5970 6.4351 4.4340 5.4301 3.4431 5.2310 7.1365 4.8521 5.3586 6.3746 5.1992 7.4676 10.2559 8.4494 4.3948 3.3043 5.3750 3.4780 7.3911 5.3054 5.7727 7.3145 5.8564 7.0199 7.0689 5.1330 2.0390 3.2058 5.7104 5.0650 7.6149 4.0559 3.9836 2.8837 1.5881 4.6857 4.6828 7.0252 6.6145 2.4426 1.5318 1.4070 1.2483 6.6693 5.2452 1.8563 3.1258 1.4539 1.4139 4.8259 4.7241 1.4548 5.0546 5.8556 3.7091 1.4575 1.3437 2.4186 4.0234 1.6815 1.9915 1.6284 2.1449 2.3078 1.6307 3.0230 1.0620 1.2276 1.2453 1.8056 1.1954 2.3359 1.2205 1.9049 2.4146 1.6706 1.9094 1.3167 1.4194 1.3502 1.5779 1.3816 11.1895 9.0389 8.9819 5.3609 2.2091 2.5547 1.9166 1.1356 2.8237 2.0746 1.1518 7.7923 7.5598 7.3566 6.4919 6.2765 5.9835 7.1281 1.0813 1.0609 1.0633 1.0865 1.1030 1.1060 1.0859 1.0892 1.0882 1.0924 1.0961 1.0932 1.1008 1.0924 1.0965 1.0760
irintensity: 0.9320 0.1112 0.5391 0.2227 0.7678 0.6022 1.8944 0.3772 1.8788 6.2813 6.8065 1.5854 1.3001 2.0324 3.1836 0.7521 3.4360 1.3024 5.9412 26.0053 0.8149 18.4402 12.8863 4.2620 2.9080 0.5432 6.7829 5.6020 7.6107 7.5676 12.1580 2.5982 9.8468 15.4103 5.8803 2.5607 40.6374 20.1572 3.4159 4.2333 21.0628 11.7767 5.8614 46.0787 108.4596 6.6719 6.9152 11.5264 7.9793 15.3866 30.5440 1.5521 2.0215 0.5745 5.3880 15.3690 10.6395 2.8708 4.6857 6.5604 21.6808 1.6268 2.7594 0.1554 2.2690 0.3717 1.4388 11.0517 12.9942 0.3186 18.2061 10.2969 23.8026 15.5385 16.0850 63.8253 2.5616 1.5211 6.7746 26.4053 12.9412 88.0056 36.5263 82.7574 89.1125 22.2319 90.1704 12.8815 12.4906 5.5330 47.2080 22.8010 118.5731 321.7057 1.7259 1.7873 22.2146 19.8476 378.2635 0.6573 26.5930 98.2737 16.6582 354.0135 194.2982 99.9683 3.6311 16.2294 8.4745 0.3792 26.3629 37.8330 26.9072 4.6346 8.1217 18.9622 4.6327 5.8197 4.4541 20.8533 14.6207 11.3419 21.2587 5.7331 5.6779 73.6309
temp: 298.150 k
press: 1.00000 atm
elementType: 16 8 8 8 8 7 7 7 7 6 6 6 6 6 6 6 6 6 6 6 6 6 6 6 6 6 6 6 1 1 1 1 1 1 1 1 1 1 1 1 1 1 1 1
symmnumber: 1
zpe: 850427.5 jmol-1
zpe.correction: 0.323911 hartree
zpe.thermalcorrener: 0.348056 hartree
zpe.thermalcorrenthalpy: 0.349001 hartree
zpe.thermalcorrgfe: 0.266619 hartree
zpe.sumelectzpe: -1649.538812 hartree
zpe.sumelectthermal: -1649.514666 hartree
zpe.sumelectthermalent: -1649.513722 hartree
zpe.sumelectthermalfe: -1649.596104 hartree
dipole: -1.3795 -6.3985 5.2452
dipole: 8.3878
quadrupole: -153.4011 -185.9599 -162.7826
quadrupole: -1.9486 9.7753 10.4068
quadrupole: 13.9801 -18.5787 4.5986 -1.9486 9.7753 10.4068
hfenergy: -1649.8627228 hartree
pointgroup: C01 [X(C19H16N4O4S1)]
dipole: 0.4704994 2.2687498 2.3497971 debye
polarizability: 351.2599262|15.2432749|253.4077372|-8.0689258|29.8126343|210.4914074 unknown
InChI: InChI=1S/C19H16N4O4S/c24-17(12-5-2-1-3-6-12)21-15-16(13-7-4-8-14(11-13)23(26)27)28-19-20-9-10-22(19)18(15)25/h1-8,11,15-16,21H,9-10H2
charge 0 multiplicity 1
44 atoms
S  3.00952 -1.449321 0.039109
O  2.016421 2.989399 0.269198
O  -1.303432 0.214156 -1.314759
O  -2.571099 -4.721149 -1.35066
O  -0.898032 -3.727024 -2.537939
N  3.590099 1.318847 -0.001947
N  -0.088562 1.361567 0.302854
N  5.3984 -0.113358 -0.223623
N  -1.557625 -3.926092 -1.448032
C  1.162757 0.704545 -0.074035
C  1.466424 -0.563969 0.785111
C  2.284063 1.762194 0.077787
C  4.754599 2.256985 0.002136
C  4.106033 -0.018111 -0.079492
C  0.349651 -1.589174 0.83573
C  5.941858 1.285319 -0.314221
C  -0.073873 -2.27341 -0.328058
C  -0.29205 -1.860832 2.069467
C  -1.262476 1.103541 -0.406034
C  -1.123383 -3.204018 -0.223688
C  -1.353774 -2.791949 2.148047
C  -1.782695 -3.476418 0.99486
C  -2.460526 1.933558 -0.040849
C  -3.544415 1.955256 -0.956076
C  -2.555271 2.670415 1.169302
C  -4.696566 2.717915 -0.67699
C  -3.711271 3.430798 1.448687
C  -4.781647 3.461147 0.524579
H  1.086527 0.387276 -1.135327
H  1.740064 -0.26003 1.810347
H  4.840323 2.741633 0.990057
H  4.601077 3.04138 -0.755935
H  6.349478 1.4430 -1.328884
H  6.771818 1.391605 0.403684
H  0.032452 2.277028 0.753329
H  0.385239 -2.097084 -1.303758
H  0.036903 -1.336808 2.97433
H  -1.841462 -2.98415 3.10876
H  -2.598431 -4.203411 1.016532
H  -3.458365 1.363652 -1.873306
H  -1.750184 2.632793 1.912307
H  -5.526704 2.733525 -1.391295
H  -3.780638 3.992692 2.386402
H  -5.677321 4.05328 0.742595
