program: Gaussian 09
title: 000178391
version: EM64L-G09RevD.01
frameworkgroup: C1[X(C20H31NO2)]
method: RPBEPBE
basis: SDD
operation: Freq
keyword: #p
keyword: freq=noraman
keyword: PBEPBE/SDD
title: #p freq=noraman PBEPBE/SDD
converged: YES YES NO NO
title: Mulliken charges:
elementType: O O N C C C C C C C C C C C C C C C C C C C C H H H H H H H H H H H H H H H H H H H H H H H H H H H H H H H
charge: -0.272605 -0.265020 -0.101836 -0.168612 -0.472676 -0.504085 -0.301325 -0.363432 -0.061087 -0.367194 -0.352560 0.012697 -0.067799 -0.570413 -0.737447 0.534579 -0.723995 -0.716458 0.344836 -0.552273 -0.465717 -0.397616 -0.203762 0.254247 0.241278 0.228078 0.220213 0.244400 0.215571 0.188789 0.188904 0.198598 0.222625 0.179541 0.210108 0.201481 0.199286 0.197771 0.210696 0.227656 0.195679 0.200036 0.212951 0.244145 0.222161 0.236638 0.200227 0.233452 0.201069 0.236566 0.255936 0.233610 0.249900 0.222190
chargesum: 0.00000
title: Mulliken charges with hydrogens summed into heavy atoms:
elementType: O O N C C C C C C C C C C C C C C C C C C C C
charge: -0.272605 -0.265020 -0.101836 0.085635 -0.003320 -0.039472 0.103035 0.024070 0.161538 0.022455 0.048207 0.210468 0.142897 -0.147079 -0.080316 0.534579 -0.064969 -0.045371 0.344836 -0.296337 -0.232107 -0.147716 0.018427
polarizability: 2.64070485e+02 -2.02446743e+00 2.58273632e+02 3.10735468e+00 -5.09354766e+00 1.67435550e+02
1716.lowfreq: -8.6407 -8.3056 0.0003 0.0006 0.0008 1.6201 11.3317 15.4098 21.2102
frequency: 10.5255 13.5150 20.8975 40.5951 49.9060 55.1844 83.7180 90.0681 97.5420 125.4158 142.8129 156.8843 159.6688 198.7433 207.5196 208.5337 222.0623 234.5378 240.1062 248.9514 291.1832 302.0400 309.9616 329.4121 347.2133 373.8365 385.7063 393.3368 404.7467 425.4779 456.3083 467.8972 477.1919 490.0298 534.9280 556.2740 576.7682 625.8479 668.0546 699.2419 737.0084 755.1946 766.4521 790.6240 803.6979 806.1018 824.8773 827.4131 851.3591 873.5044 884.7897 891.9454 896.3103 900.4936 906.7324 918.5498 926.6709 935.1168 949.0485 950.3003 958.8774 971.8696 976.0275 989.8734 1014.5162 1018.0114 1038.0591 1059.9208 1062.0950 1062.9461 1085.1095 1088.6112 1097.7963 1103.7534 1120.9318 1132.5670 1139.8553 1147.4515 1154.3200 1158.2046 1160.9897 1165.1941 1167.2348 1170.8435 1208.2595 1215.4410 1226.3962 1243.0458 1248.8264 1252.1048 1280.2485 1287.1089 1295.1587 1304.9429 1308.4980 1323.7109 1330.3376 1334.3306 1338.3945 1340.1323 1347.2436 1355.6579 1371.2069 1383.2057 1387.3298 1388.6221 1390.8958 1407.7595 1433.5896 1443.9589 1446.6077 1455.7987 1460.3882 1463.0510 1467.2580 1468.8995 1474.3616 1474.6855 1477.2544 1480.0139 1481.6893 1482.0561 1484.0654 1600.6314 1604.9294 2848.5413 2854.7495 2867.1094 2937.3929 2959.8917 2967.6433 2968.8111 2976.4291 2978.4108 2989.7332 2998.0447 3005.5492 3025.0682 3029.6641 3034.4555 3039.6656 3058.8638 3071.6075 3077.5366 3087.5634 3094.2778 3097.4163 3097.8373 3105.1722 3122.3182 3134.9489 3140.9623 3144.5523 3168.2882 3192.4674 3212.5231
redmass: 3.7473 4.3311 3.8728 3.8051 4.2232 2.7289 3.0408 3.8290 3.1739 3.3481 2.7192 2.8249 2.8624 2.2382 1.0433 1.1125 1.2876 4.2497 2.7225 3.0941 3.6400 2.9343 3.1230 2.4377 2.8848 2.2401 2.4141 2.2010 2.2973 2.9669 2.9424 3.1456 3.5223 2.5086 3.6428 4.1287 6.5821 4.8096 2.6993 2.2343 3.7988 3.3419 1.0956 1.6376 3.1051 1.6829 1.9493 1.9133 2.2640 1.6592 1.7476 1.8757 1.6010 2.1331 1.6143 1.7898 1.7364 1.7713 1.9407 2.2740 1.8613 1.3241 4.3141 5.0210 2.2086 2.1164 1.2411 2.1957 1.5896 1.3560 1.8645 1.8674 1.9134 1.1830 2.1840 2.1574 2.0207 2.1104 1.6071 2.0305 1.6289 1.8678 1.7773 1.1884 1.3863 1.5580 1.3212 1.3339 2.0677 1.7534 1.2982 1.3232 1.4110 1.4273 1.3275 1.5754 1.3905 1.1749 1.2822 1.3434 1.4328 1.3560 1.2694 1.3661 1.8697 2.0734 1.4312 1.7327 2.8070 1.0900 1.0786 1.0772 1.0545 1.0592 1.1133 1.2245 1.3895 1.0727 1.1127 1.0599 1.0543 1.0578 1.8741 6.7585 6.1062 1.0692 1.0708 1.0687 1.0557 1.0826 1.0390 1.0666 1.0719 1.0380 1.0359 1.1064 1.0895 1.0867 1.0893 1.1021 1.0886 1.0987 1.0961 1.0988 1.0993 1.0526 1.1007 1.0998 1.0615 1.0867 1.0917 1.0909 1.0925 1.0971 1.1166 1.1145
irintensity: 0.2327 0.1422 0.2883 0.0284 0.5001 0.0180 0.2815 0.1381 0.5268 3.0628 2.3574 2.0695 1.1362 0.3560 0.0419 0.1019 0.0046 0.4675 1.4481 2.3019 1.5556 0.6401 2.2705 1.5344 2.2615 2.2630 4.4315 1.5087 0.2730 2.5836 3.6173 3.8692 0.4569 6.8047 1.5495 0.5780 5.6242 0.6448 0.9357 18.4055 19.1238 10.0921 0.6120 43.7780 9.6719 10.0575 3.4513 10.4329 11.1753 11.2984 13.0717 3.6170 0.3931 6.1303 6.7926 11.1941 0.8622 2.7631 7.8436 16.6171 2.8165 1.2758 58.2601 62.7481 20.1930 67.4412 26.5676 32.7008 19.6043 3.8406 28.8373 14.8084 3.4946 1.0006 27.3035 10.4076 12.1992 19.4925 13.2125 1.0465 82.4714 13.6915 47.7770 5.6553 5.9469 7.0881 34.6777 1.0173 71.1847 56.1242 6.2768 7.9499 22.1400 2.8628 5.2707 2.0797 11.2308 7.3024 4.3332 5.5147 3.3974 6.5569 22.0883 14.4860 13.7234 25.0651 13.0979 43.0694 34.4760 8.6886 0.5127 2.5716 7.7502 8.2494 13.0083 22.8173 11.2893 13.0511 7.7055 12.1292 13.6731 8.2802 20.1269 28.6641 127.5001 50.6389 27.5763 228.9244 45.3645 40.3065 38.5899 5.2191 19.6398 34.0963 27.5997 36.4516 28.7628 35.7610 33.8499 20.5427 30.0798 49.1871 44.2201 32.4764 32.6700 20.8390 41.7141 20.6008 11.5063 9.1917 9.0228 32.0472 5.5874 12.5773 1.4955 35.7671
temp: 298.150 k
press: 1.00000 atm
elementType: 8 8 7 6 6 6 6 6 6 6 6 6 6 6 6 6 6 6 6 6 6 6 6 1 1 1 1 1 1 1 1 1 1 1 1 1 1 1 1 1 1 1 1 1 1 1 1 1 1 1 1 1 1 1
symmnumber: 1
zpe: 1232270.2 jmol-1
zpe.correction: 0.469347 hartree
zpe.thermalcorrener: 0.493763 hartree
zpe.thermalcorrenthalpy: 0.494708 hartree
zpe.thermalcorrgfe: 0.412126 hartree
zpe.sumelectzpe: -984.071445 hartree
zpe.sumelectthermal: -984.047029 hartree
zpe.sumelectthermalent: -984.046085 hartree
zpe.sumelectthermalfe: -984.128666 hartree
dipole: -1.1158 0.1274 0.5430
dipole: 1.2474
quadrupole: -145.1893 -137.0328 -141.0274
quadrupole: -13.2918 1.8387 0.1547
quadrupole: -4.1061 4.0504 0.0557 -13.2918 1.8387 0.1547
hfenergy: -984.5407924 hartree
pointgroup: C01 [X(C20H31N1O2)]
dipole: 0.4344581 -0.069789 0.2173447 debye
polarizability: 263.846393|-2.4194788|258.7197756|-2.3150138|3.0763926|167.2134982 unknown
InChI: InChI=1S/C20H31NO2/c1-15(11-21-12-16(2)23-17(3)13-21)9-19-5-4-6-20(10-19)22-14-18-7-8-18/h4-6,10,15-18H,7-9,11-14H2,1-3H3
charge 0 multiplicity 1
54 atoms
O  4.08966 2.051851 0.014628
O  -3.68045 0.584391 -0.368524
N  2.855038 -0.525713 0.424446
C  -3.760441 2.991353 -0.283262
C  -4.402455 3.453586 1.030577
C  -3.285102 4.291146 0.389587
C  -2.839047 1.796879 -0.292392
C  2.552407 -1.863945 0.988786
C  1.031807 -2.164076 1.043322
C  4.202385 -0.419039 -0.188409
C  2.665235 0.573926 1.401827
C  4.345825 0.930417 -0.921259
C  2.780857 1.947957 0.705508
C  0.458111 -2.280528 -0.402831
C  0.75403 -3.431409 1.880393
C  -1.05321 -2.128528 -0.475587
C  5.750803 1.164761 -1.477536
C  1.600659 2.252284 -0.237953
C  -3.027296 -0.658862 -0.437165
C  -1.62326 -0.828976 -0.394832
C  -1.91016 -3.248035 -0.601178
C  -3.881007 -1.785012 -0.5590
C  -3.315368 -3.070876 -0.641025
H  -4.365536 3.095486 -1.189848
H  -5.425613 3.83686 0.994749
H  -4.16687 2.885769 1.935805
H  -2.302621 4.291983 0.873357
H  -3.54978 5.240398 -0.083748
H  -2.159282 1.823774 -1.170191
H  -2.222258 1.766799 0.631816
H  2.990351 -1.984431 2.012102
H  3.038259 -2.62346 0.343668
H  0.524001 -1.309151 1.535478
H  5.016435 -0.496961 0.578133
H  4.332643 -1.243574 -0.914262
H  3.430393 0.518921 2.217762
H  1.667587 0.485213 1.868676
H  3.595632 0.962919 -1.740395
H  2.847077 2.735679 1.478852
H  0.945432 -1.489256 -1.005113
H  0.763549 -3.259808 -0.822892
H  1.288407 -4.306205 1.460313
H  1.085141 -3.304004 2.92817
H  -0.325045 -3.666864 1.889205
H  6.496805 1.1469 -0.663196
H  5.803511 2.151243 -1.968764
H  6.014056 0.388437 -2.219058
H  1.419951 1.416839 -0.936148
H  0.677271 2.416377 0.350811
H  1.806805 3.169887 -0.815804
H  -0.95203 0.032656 -0.31118
H  -1.479918 -4.253738 -0.673846
H  -4.963157 -1.626153 -0.592368
H  -3.973318 -3.941688 -0.740703
