program: Gaussian 09
title: 000178386
version: EM64L-G09RevD.01
frameworkgroup: C1[X(C11H23N2O4PS)]
method: RPBEPBE
basis: SDD
operation: Freq
keyword: #p
keyword: freq=noraman
keyword: PBEPBE/SDD
title: #p freq=noraman PBEPBE/SDD
converged: YES YES NO NO
title: Mulliken charges:
elementType: S P O O O O N N C C C C C C C C C C C H H H H H H H H H H H H H H H H H H H H H H H
charge: 1.093036 1.399586 -0.641395 -0.572886 -0.533504 -0.487800 -0.542006 -0.559919 -0.349095 -0.307364 -0.349998 -0.314776 -0.369033 -0.367579 -0.390666 -0.427392 -0.401387 -0.395519 -0.725792 0.221770 0.247927 0.241160 0.213263 0.244269 0.234465 0.242798 0.261659 0.200922 0.199016 0.205739 0.200314 0.206007 0.209194 0.222386 0.212041 0.219882 0.193782 0.208775 0.208252 0.280544 0.280791 0.288531
chargesum: 0.00000
title: Mulliken charges with hydrogens summed into heavy atoms:
elementType: S P O O O O N N C C C C C C C C C C C
charge: 1.093036 1.399586 -0.641395 -0.572886 -0.533504 -0.487800 -0.542006 -0.559919 0.120602 0.147059 0.128736 0.189682 0.030905 0.038473 0.024536 0.007035 0.012277 0.021508 0.124074
polarizability: 2.26018836e+02 4.84852528e+00 2.04366329e+02 6.36094893e-01 6.02973070e-01 1.66795841e+02
1716.lowfreq: -10.2474 -8.9680 -6.3999 0.0012 0.0019 0.0028 10.6715 19.9895 32.8335
frequency: 5.9486 19.4825 32.6934 42.1897 49.5911 65.7258 75.7761 101.5982 125.5686 140.3976 165.8685 172.3938 178.4014 182.7304 217.0008 228.9422 235.8927 254.3753 268.2051 293.2762 305.2122 319.6637 331.1645 351.4627 373.3204 393.7632 418.4110 437.3769 444.4547 474.1355 489.0989 518.0291 529.7059 563.0294 594.4094 650.4829 701.8861 774.9613 804.8682 824.0608 828.0347 832.4396 845.0726 862.6278 898.6370 905.0553 913.4234 935.0620 944.8750 949.3632 955.4465 984.7492 1009.7496 1023.3364 1035.2659 1040.7604 1057.6754 1069.6053 1079.6530 1090.8504 1118.6151 1121.7827 1150.5687 1151.8046 1155.8013 1174.1422 1210.7912 1217.3686 1250.4708 1253.8070 1260.6323 1272.7377 1298.0388 1311.4588 1318.4668 1323.3287 1325.9338 1330.2685 1335.9780 1345.1245 1345.8276 1348.4851 1352.7360 1368.1010 1369.6505 1414.1288 1416.3598 1451.3701 1459.9866 1461.7550 1462.6086 1467.8403 1472.8134 1475.4247 1478.2919 1483.3369 1492.1852 2928.4866 2942.2953 2955.3896 2970.3382 2976.1254 2980.0716 2981.2122 2986.0122 2994.2188 2995.0940 3032.8334 3035.5990 3040.2828 3043.2207 3044.6753 3053.8378 3054.5291 3061.2966 3069.1835 3069.9890 3081.6619 3187.4671 3201.6798
redmass: 3.6569 7.1073 4.2649 4.3302 2.9612 3.4466 6.0213 3.3234 5.1397 3.7052 2.5359 1.4007 2.7288 3.4456 2.9013 4.3655 3.3303 2.0004 2.6439 4.8837 3.3922 3.8146 5.3135 7.6356 5.0352 2.0867 5.3304 2.8786 4.2947 3.4639 5.0124 2.9036 4.2745 3.8193 9.0495 2.9828 2.5001 1.4062 1.4895 2.7815 4.4607 2.6758 1.5410 1.7400 2.4410 2.5678 2.7623 3.0027 2.7574 1.3337 1.5781 1.3279 2.4835 2.2807 2.1015 2.8533 2.2428 2.5273 1.4672 1.7107 3.9599 3.2136 1.3724 1.9867 2.3575 1.2108 1.7296 1.9422 1.2616 1.2443 1.1893 1.1613 1.2878 1.1380 1.4973 1.3196 1.3425 1.2753 1.3577 1.3693 1.3676 1.4074 1.3155 1.3453 1.3357 1.0533 1.0509 1.0915 1.0879 1.0831 1.0800 1.0812 1.0816 1.0866 1.0885 1.0735 1.0826 1.0701 1.0696 1.0677 1.0628 1.0636 1.0609 1.0593 1.0609 1.0666 1.0612 1.0991 1.0967 1.0248 1.1022 1.0992 1.1029 1.0990 1.0999 1.0925 1.1023 1.0941 1.1075 1.1077
irintensity: 0.8804 3.3979 1.0846 1.4680 0.2087 0.4224 0.7556 1.3685 0.7872 2.7736 1.7510 0.5885 1.3084 2.2937 2.5203 8.7144 1.4865 2.2335 1.2168 11.1697 28.2249 2.9371 25.0538 18.5371 14.4721 11.3138 20.4674 1.6335 30.2459 11.1702 24.0866 13.6315 193.7687 135.0850 109.8565 22.4293 36.1879 11.6813 0.4699 13.5023 22.7105 32.8377 12.9748 4.4771 0.4961 0.4620 29.8863 41.2491 157.6828 2.6888 44.2686 39.2126 12.5632 8.7431 55.5287 61.6089 69.7477 58.2976 12.8094 42.0540 3.9623 17.6394 9.2096 19.9810 25.0368 0.5307 24.0360 33.8995 5.8777 1.3925 6.3120 12.2271 10.7245 3.9933 3.4968 1.3251 0.2361 1.9079 1.3531 1.1382 3.6037 2.1816 1.6396 9.9515 11.1096 12.3307 10.3236 6.0100 11.4588 15.2548 8.9443 3.0509 4.8765 10.5433 13.9526 9.1658 5.2948 54.4229 68.2610 21.4349 42.5043 16.3068 25.1466 39.2518 31.3650 36.5152 48.6100 17.5274 67.6466 0.1024 33.1824 20.8494 82.7384 37.1879 49.5785 16.8058 51.5455 9.2326 0.5696 0.1297
temp: 298.150 k
press: 1.00000 atm
elementType: 16 15 8 8 8 8 7 7 6 6 6 6 6 6 6 6 6 6 6 1 1 1 1 1 1 1 1 1 1 1 1 1 1 1 1 1 1 1 1 1 1 1
symmnumber: 1
zpe: 905278.6 jmol-1
zpe.correction: 0.344802 hartree
zpe.thermalcorrener: 0.367072 hartree
zpe.thermalcorrenthalpy: 0.368016 hartree
zpe.thermalcorrgfe: 0.290089 hartree
zpe.sumelectzpe: -1580.928395 hartree
zpe.sumelectthermal: -1580.906125 hartree
zpe.sumelectthermalent: -1580.905181 hartree
zpe.sumelectthermalfe: -1580.983108 hartree
dipole: 4.7435 0.1220 -6.3848
dipole: 7.9550
quadrupole: -132.8231 -119.3375 -135.2635
quadrupole: -0.3972 14.9289 8.5002
quadrupole: -3.6817 9.8039 -6.1222 -0.3972 14.9289 8.5002
hfenergy: -1581.2731977 hartree
pointgroup: C01 [X(C11H23N2O4P1S1)]
dipole: -1.4787274 -1.2567918 -2.4554136 debye
polarizability: 214.9261489|11.8975539|215.0897577|-0.1257901|-4.2045792|167.1650998 unknown
InChI: InChI=1S/C11H23N2O4PS/c1-19(15,16)17-18(14,12-8-4-2-5-9-12)13-10-6-3-7-11-13/h2-11H2,1H3
charge 0 multiplicity 1
42 atoms
S  1.888407 2.657547 -0.384779
P  0.05667 0.439344 1.019722
O  0.261989 1.770206 -0.217331
O  0.512284 0.903921 2.472908
O  3.067412 1.545177 -0.494767
O  2.032979 3.900744 0.63252
N  -1.603192 0.163806 0.623927
N  0.900826 -0.943976 0.433805
C  -2.222015 -1.182271 0.685882
C  -2.57467 1.285938 0.616868
C  0.848705 -1.32413 -1.000188
C  2.160202 -1.337047 1.145659
C  -3.171342 -1.382705 -0.515652
C  -3.526326 1.14232 -0.590874
C  0.7902 -2.871878 -1.129796
C  2.706028 -2.653574 0.532449
C  -4.217067 -0.243091 -0.587543
C  1.55149 -3.555666 0.043481
C  1.471727 3.319011 -2.117565
H  -2.799336 -1.277094 1.633187
H  -1.424604 -1.944051 0.699687
H  -2.023446 2.23908 0.571355
H  -3.162335 1.271892 1.561086
H  1.747041 -0.922284 -1.51415
H  -0.033258 -0.851281 -1.466521
H  1.915753 -1.471602 2.213776
H  2.917777 -0.531468 1.066721
H  -3.674705 -2.36476 -0.422791
H  -2.573357 -1.400449 -1.448323
H  -2.939101 1.26917 -1.520906
H  -4.282231 1.950657 -0.557061
H  1.239999 -3.159105 -2.100186
H  -0.261134 -3.216508 -1.145466
H  3.317403 -3.170004 1.294918
H  3.380934 -2.427171 -0.31546
H  -4.852633 -0.360228 -1.48537
H  -4.889519 -0.311553 0.292983
H  0.856563 -3.733991 0.886571
H  1.933433 -4.544016 -0.272832
H  2.350861 3.897011 -2.435528
H  1.288556 2.437727 -2.744201
H  0.577132 3.942256 -1.994314
