program: Gaussian 09
title: 000178368
version: EM64L-G09RevD.01
frameworkgroup: C1[X(C3H10NO3P)]
method: RPBEPBE
basis: SDD
operation: Freq
keyword: #p
keyword: freq=noraman
keyword: PBEPBE/SDD
title: #p freq=noraman PBEPBE/SDD
converged: YES YES NO NO
title: Mulliken charges:
elementType: P O O O N C C C H H H H H H H H H H
charge: 1.171566 -0.694849 -0.680509 -0.640439 -0.545145 -0.406357 -0.357299 -0.695757 0.316591 0.234942 0.228275 0.262569 0.200798 0.226070 0.314490 0.297582 0.384372 0.383100
chargesum: 0.00000
title: Mulliken charges with hydrogens summed into heavy atoms:
elementType: P O O O N C C C
charge: 1.171566 -0.310477 -0.297409 -0.640439 0.066928 -0.089765 0.105918 -0.006321
polarizability: 8.14994220e+01 -4.25689304e+00 7.59786134e+01 8.39548050e-01 -3.16007442e-01 6.66740959e+01
1716.lowfreq: -13.4999 -0.0022 -0.0016 -0.0015 11.9696 19.4576 23.3298 107.0044 123.8459
frequency: 21.8905 106.9866 123.7965 131.4128 171.1165 210.3779 241.8397 248.3646 273.4675 330.1534 356.8670 368.1660 385.7404 405.0900 503.4870 596.7038 617.8469 661.4593 703.6089 795.3857 848.4771 957.3738 967.9591 1016.9678 1022.2102 1046.3099 1098.0343 1161.1611 1199.6282 1268.0427 1287.0189 1350.4974 1365.6120 1404.0113 1459.3031 1485.3232 1490.3610 1646.9836 2978.3826 2999.3196 3045.2199 3050.5431 3076.0792 3085.1608 3507.3172 3577.4081 3588.7635 3635.7507
redmass: 4.7200 2.9523 3.3831 4.4701 1.5396 1.8456 2.9373 2.3393 3.5352 2.1434 1.9661 1.2708 1.8501 2.3679 3.0546 1.5327 2.6164 7.6062 9.2232 1.2506 2.4749 2.2702 1.1688 2.2352 1.3128 1.8029 1.7203 1.5024 1.8991 1.5875 1.2408 1.4342 1.4190 1.2084 1.0745 1.0478 1.0458 1.0982 1.0369 1.0612 1.0870 1.1004 1.1001 1.1003 1.0448 1.0661 1.0661 1.1001
irintensity: 0.2081 0.8835 5.0274 3.7916 5.5164 3.6573 68.6563 16.1479 4.1852 109.0533 17.3126 187.1449 31.6868 28.1284 9.3782 240.7678 194.1307 133.3903 245.2851 24.2775 20.4227 9.6826 47.6519 12.3496 18.0505 97.7723 29.2511 11.7457 40.5258 8.9948 25.8223 0.8170 9.0061 18.9966 12.5306 11.4773 10.3921 74.7129 25.3448 19.0707 8.1272 2.5487 42.1187 23.7529 16.8426 32.2481 33.2039 17.1388
temp: 298.150 k
press: 1.00000 atm
elementType: 15 8 8 8 7 6 6 6 1 1 1 1 1 1 1 1 1 1
symmnumber: 1
zpe: 370082.6 jmol-1
zpe.correction: 0.140957 hartree
zpe.thermalcorrener: 0.152306 hartree
zpe.thermalcorrenthalpy: 0.153250 hartree
zpe.thermalcorrgfe: 0.103902 hartree
zpe.sumelectzpe: -741.289280 hartree
zpe.sumelectthermal: -741.277931 hartree
zpe.sumelectthermalent: -741.276986 hartree
zpe.sumelectthermalfe: -741.326335 hartree
dipole: -0.2761 0.8627 -0.3844
dipole: 0.9840
quadrupole: -48.9870 -54.5843 -62.5570
quadrupole: -0.0752 0.0842 6.7894
quadrupole: 6.3891 0.7918 -7.1809 -0.0752 0.0842 6.7894
hfenergy: -741.4302367 hartree
pointgroup: C01 [X(C3H10N1O3P1)]
dipole: -0.0661531 -0.3479611 0.1562812 debye
dipolederiv: 1.6681631 -0.1296708 0.0595065 -0.3012046 1.3654205 0.2119492 0.2229305 0.2717735 1.4229282 -1.0666303 0.2729689 -0.0596639 0.3898241 -0.7638514 -0.1326354 -0.0378765 -0.0706575 -0.5465665 -0.7902581 -0.1529394 -0.21342 -0.1481013 -0.8644101 -0.3174171 -0.2595614 -0.4229929 -0.7873454 -0.7954794 -0.1084356 0.0769839 0.0059426 -0.6779233 0.0786948 -0.0151517 0.1383739 -0.7341083 -0.6495422 -0.3237225 0.189323 -0.4840675 -0.9932921 0.0012297 0.0950037 -0.1180984 -0.3717087 0.6054499 0.4860308 -0.1700532 0.662003 0.8377265 0.0119464 -0.0581479 0.1863737 0.0857734 0.006791 0.0302016 0.0207406 -0.1184454 0.0453229 -0.0007462 0.0922598 -0.0006461 0.0635929 -0.0167036 0.0423219 -0.0125947 0.0615147 0.0505784 0.0462182 -0.0423714 0.051579 -0.0513568 -0.0260177 -0.0454593 -0.0339698 -0.0120566 0.0040525 0.0556238 -0.0245156 0.0444987 -0.053644 -0.0905525 -0.0476207 0.0980239 -0.0346482 0.0407653 0.0907035 0.0590386 0.0682141 -0.0085705 0.0710902 -0.0522941 -0.0710961 -0.0138762 -0.0552449 -0.085856 -0.0550859 -0.0615785 0.0181941 0.0560586 -0.0789178 0.0933686 -0.0590959 0.0675399 0.0398918 0.0484087 0.0358437 0.0149104 0.0743376 -0.0466513 -0.0477341 -0.1018914 -0.0986306 -0.1159669 -0.0476933 -0.0777152 0.0036823 -0.0806398 0.1281375 -0.0041036 0.1469794 0.0006025 -0.010374 0.0280441 -0.028229 0.086619 0.1704833 0.13649 -0.0596663 0.1058411 0.2988341 -0.0695273 -0.0600079 -0.141958 0.2357222 0.3323003 0.0632354 -0.0572889 0.0556256 0.2320426 0.0300369 -0.105364 -0.0095639 0.1078824 0.2388044 -0.0598367 0.1149381 -0.0265077 0.2907391 0.0851015 0.11223 0.0860332 0.2633084 0.2923451 -0.1138378 0.076706 -0.1278358 0.2197281 0.0811271 0.04786 0.0487497 0.2506869 unknown
polarizability: 80.361377|4.8019158|77.1123589|-0.7732973|-0.5496527|66.6783954 unknown
InChI: InChI=1S/C3H10NO3P/c1-2-3(4)8(5,6)7/h3,5-6H,2,4H2,1H3
charge 0 multiplicity 1
18 atoms
P  0.994322 0.339927 -0.05296
O  2.184346 -0.945953 -0.046311
O  1.41512 1.367153 1.300779
O  0.965903 1.124834 -1.450592
N  -0.721817 -1.917657 0.00704
C  -0.491901 -0.687847 0.705347
C  -1.736045 0.219844 0.798105
C  -2.373857 0.580938 -0.563431
H  -0.095917 -0.892375 1.715544
H  -2.471345 -0.314079 1.429462
H  -1.454183 1.143276 1.337749
H  -1.643257 1.067504 -1.235281
H  -2.784616 -0.308845 -1.076778
H  -3.21576 1.279062 -0.41188
H  0.035187 -2.602908 0.031479
H  -1.209284 -1.854505 -0.887844
H  2.942413 -0.801582 -0.668011
H  1.927493 2.178513 1.050585
