program: Gaussian 09
title: 000178434
version: EM64L-G09RevD.01
frameworkgroup: C1[X(C25H22N4O2S)]
method: RPBEPBE
basis: SDD
operation: Freq
keyword: #p
keyword: freq=noraman
keyword: PBEPBE/SDD
title: #p freq=noraman PBEPBE/SDD
converged: YES YES NO NO
title: Mulliken charges:
elementType: S O O N N N N C C C C C C C C C C C C C C C C C C C C C C C C C H H H H H H H H H H H H H H H H H H H H H H
charge: 0.328301 -0.213577 -0.291082 -0.217597 -0.410729 0.002168 -0.151701 -0.105111 -0.712486 0.081087 0.616540 -0.223878 0.338570 -0.034987 -0.464865 -0.380107 -0.336229 0.199213 0.401786 -0.359361 -0.380913 -0.333222 -0.220386 -0.224535 0.267513 -0.646690 -0.646453 -0.345797 -0.366645 -0.225946 -0.233582 -0.226310 0.311514 0.305473 0.325909 0.226226 0.277824 0.291154 0.237890 0.243827 0.255372 0.228105 0.229806 0.238983 0.237337 0.216943 0.233669 0.235987 0.218370 0.272588 0.234297 0.232796 0.230232 0.232708
chargesum: 0.00000
title: Mulliken charges with hydrogens summed into heavy atoms:
elementType: S O O N N N N C C C C C C C C C C C C C C C C C C C C C C C C C
charge: 0.328301 -0.213577 -0.291082 -0.217597 -0.084821 0.002168 -0.151701 0.206403 -0.407013 0.081087 0.616540 -0.223878 0.338570 -0.034987 -0.238638 -0.102283 -0.045075 0.199213 0.401786 -0.121471 -0.137086 -0.077850 0.007719 0.005271 0.267513 0.046574 0.041572 -0.073208 -0.132348 0.006849 -0.003349 0.006398
polarizability: 5.31211839e+02 8.01484120e+00 3.18556888e+02 2.93140855e+00 9.16961248e+00 2.27166379e+02
1716.lowfreq: -5.7378 -1.7891 -0.0012 0.0013 0.0016 1.9321 16.7039 23.2853 26.8973
frequency: 16.6721 23.2705 26.8930 29.2397 36.6294 40.4724 73.3460 81.9703 92.5756 92.7249 96.2492 115.2389 123.3244 132.0811 143.1472 155.0011 170.8104 195.4258 198.5254 234.0619 248.5421 264.4826 280.2314 309.3213 326.5608 331.3148 359.8739 376.0976 392.0965 403.9873 407.0723 420.6410 422.1209 432.3766 438.3806 446.5609 480.7329 505.2866 528.1885 534.2917 542.7606 569.1296 574.3370 614.2967 618.5239 621.7133 628.9462 642.7799 653.2338 664.8191 675.6316 689.3873 704.0973 719.8957 750.7479 761.6547 768.1372 771.0224 793.3976 806.1506 814.5766 826.9655 833.9150 857.8425 867.5019 878.1711 903.3849 938.8325 942.1065 942.9386 953.5545 962.7160 977.1478 985.3657 986.3876 990.3075 996.5118 1005.0208 1011.5907 1021.6399 1026.6455 1056.1972 1071.7248 1084.0701 1096.2623 1108.6167 1111.0378 1135.6536 1147.1234 1154.7412 1159.0695 1166.0683 1169.9318 1174.0306 1181.6750 1190.0308 1202.9234 1221.7106 1227.8994 1246.3092 1260.3569 1265.7227 1287.1030 1297.5267 1317.7308 1321.0489 1338.3171 1348.0344 1366.3301 1385.4503 1392.0409 1394.4427 1430.3208 1432.6069 1436.9742 1445.0646 1454.4715 1459.7878 1461.8820 1464.1959 1464.6176 1476.2843 1487.5599 1492.5668 1505.5758 1532.1023 1561.8727 1572.1083 1590.6351 1601.2075 1605.7987 1611.8474 1619.7189 1631.4084 2940.8734 2949.4394 2969.1411 3005.9511 3012.0330 3028.7004 3096.6793 3106.9003 3114.1067 3126.0618 3134.4733 3137.1245 3141.3521 3147.0017 3156.3479 3159.0986 3166.3160 3170.5187 3170.8954 3174.7910 3200.3135 3528.5187
redmass: 5.2181 5.8293 4.1011 6.1014 5.4957 3.6024 2.9647 6.1944 4.1759 4.2572 3.4377 2.1541 4.0898 6.0643 6.5424 4.8552 5.5506 1.1890 4.6577 2.8532 3.9344 6.5745 5.2674 5.9412 6.9426 4.3362 5.9730 5.2703 7.4971 3.0503 5.5952 5.9939 3.0975 4.2994 3.5847 3.7951 3.6530 3.4701 2.8247 3.9983 1.8165 5.4417 4.4924 6.3692 6.2083 7.1434 6.5838 7.2485 5.9655 6.1373 4.6254 5.0882 1.5729 4.7481 3.9304 2.3338 5.8319 1.8981 2.3510 1.2965 5.8987 1.8377 5.8129 1.2478 7.0237 1.4088 6.4170 1.4388 1.3818 3.0831 1.3771 1.3728 5.1712 1.4767 1.3053 4.7920 3.1571 1.3380 2.0701 3.1487 3.2439 1.4961 3.2562 1.7269 2.3855 1.2381 1.3229 1.5281 1.9542 1.5499 1.4689 1.6951 2.9593 1.0591 2.2693 1.2014 1.2561 2.5485 1.4145 1.7294 2.8041 1.9830 1.5019 1.9995 1.3438 1.3937 6.7597 1.5761 3.0567 9.2600 3.4345 5.4018 1.3281 2.1917 2.9687 2.3541 5.4711 1.2160 3.4647 1.8849 1.0539 1.0457 2.3531 1.0943 1.1133 2.6366 6.2716 6.2865 8.3813 7.5493 6.9522 6.0038 8.3981 6.0264 1.0369 1.0392 1.0807 1.1002 1.1020 1.0864 1.0963 1.0942 1.0895 1.0856 1.0881 1.0865 1.0894 1.0926 1.0925 1.0960 1.0926 1.1007 1.0942 1.0974 1.0958 1.0764
irintensity: 0.2944 0.7560 0.9934 0.3892 0.7357 0.4639 2.7780 0.7946 8.5996 1.7997 3.4613 0.6252 0.1646 0.0059 1.3730 1.3115 1.7935 0.2478 10.7458 0.4820 5.4524 1.8153 15.0452 4.0828 5.0344 9.9362 4.1365 2.5870 9.6530 5.3174 17.8041 23.7731 1.1314 12.6378 4.1086 3.1092 2.0013 83.2566 39.7653 19.3487 45.1073 9.6823 1.6176 0.8559 4.3768 6.5186 8.3177 5.1959 16.4831 0.7824 17.1273 4.8187 75.4733 37.9433 8.9682 35.9728 8.8774 58.2270 17.1701 5.1256 2.3682 68.6826 11.7515 1.5646 5.3452 0.1895 2.8332 2.4563 1.4038 18.7308 5.0611 2.4479 18.8221 2.4536 0.0631 0.2171 0.5384 1.0034 11.1259 15.5195 0.8629 25.1629 8.0512 23.5175 0.4279 0.0254 0.9055 6.9037 68.5572 31.1696 50.4081 29.2446 38.9756 1.1138 25.5520 15.1907 124.9530 0.4127 1.8778 41.9240 25.2777 44.7142 0.4387 112.0557 4.5074 32.6220 473.4108 16.2399 192.6818 1.5943 21.3759 71.5458 10.5927 24.4664 293.8009 0.4663 244.1230 13.6447 40.9219 161.4316 5.1497 21.4896 99.9335 1.9876 48.8181 213.9491 6.7889 105.1002 109.4610 55.3561 20.1596 7.1003 8.4920 385.0584 103.9432 118.5445 52.1152 24.9844 57.2069 5.6217 4.0829 51.3900 10.8415 3.6240 4.0293 5.2900 4.1901 22.5204 22.6068 16.3808 18.0651 21.6739 13.0536 19.0580 4.1750 32.1740
temp: 298.150 k
press: 1.00000 atm
elementType: 16 8 8 7 7 7 7 6 6 6 6 6 6 6 6 6 6 6 6 6 6 6 6 6 6 6 6 6 6 6 6 6 1 1 1 1 1 1 1 1 1 1 1 1 1 1 1 1 1 1 1 1 1 1
symmnumber: 1
zpe: 1095384.7 jmol-1
zpe.correction: 0.417210 hartree
zpe.thermalcorrener: 0.445317 hartree
zpe.thermalcorrenthalpy: 0.446262 hartree
zpe.thermalcorrgfe: 0.355586 hartree
zpe.sumelectzpe: -1731.160161 hartree
zpe.sumelectthermal: -1731.132054 hartree
zpe.sumelectthermalent: -1731.131110 hartree
zpe.sumelectthermalfe: -1731.221786 hartree
dipole: -6.0554 0.7547 3.3661
dipole: 6.9691
quadrupole: -154.2045 -185.6753 -189.7570
quadrupole: 14.9864 -0.9099 -1.0176
quadrupole: 22.3411 -9.1297 -13.2114 14.9864 -0.9099 -1.0176
hfenergy: -1731.5773712 hartree
pointgroup: C01 [X(C25H22N4O2S1)]
dipole: 2.4084731 0.334464 -1.2669505 debye
polarizability: 530.7215115|-11.7431758|319.6660434|7.1185303|-3.889195|226.5475511 unknown
InChI: InChI=1S/C25H22N4O2S/c1-28(2)18-14-12-16(13-15-18)22-21(27-23(30)17-8-4-3-5-9-17)24(31)29-20-11-7-6-10-19(20)26-25(29)32-22/h3-15,21-22,27H,1-2H3
charge 0 multiplicity 1
54 atoms
S  -1.391861 -2.500037 0.481225
O  -2.2459 1.843787 -0.590236
O  1.191859 1.31126 2.07034
N  -3.065407 -0.269316 -0.069694
N  0.334546 1.259132 -0.094596
N  -4.151699 -2.270142 0.320983
N  5.159226 -3.143655 -0.191235
C  -0.611487 0.196761 0.228854
C  -0.271476 -1.178657 -0.43038
C  -2.024855 0.672199 -0.179806
C  1.154146 -1.646298 -0.347507
C  -2.968453 -1.674656 0.249242
C  -4.463765 -0.003966 -0.221357
C  -5.109717 -1.251419 0.049336
C  1.756091 -2.25597 -1.478659
C  1.925393 -1.553788 0.841829
C  -5.178914 1.163342 -0.541415
C  1.171117 1.783996 0.888642
C  3.852701 -2.654661 -0.245384
C  3.071509 -2.748101 -1.442582
C  3.240304 -2.040676 0.896316
C  -6.513867 -1.3499 0.008778
C  -6.58979 1.048691 -0.57764
C  -7.245908 -0.182822 -0.308388
C  2.035304 2.94129 0.474564
C  5.936113 -3.034172 1.050936
C  5.75619 -3.779329 -1.372591
C  2.529105 3.792567 1.495854
C  2.389641 3.194039 -0.876671
C  3.343045 4.896628 1.17003
C  3.209167 4.297232 -1.200657
C  3.681424 5.154852 -0.179968
H  -0.577632 0.070668 1.332504
H  -0.617325 -1.199294 -1.479788
H  0.122168 1.833648 -0.914139
H  1.18122 -2.350362 -2.409109
H  1.505615 -1.077523 1.734476
H  -4.668476 2.104827 -0.750373
H  3.48898 -3.20661 -2.342968
H  3.795873 -1.938706 1.832207
H  -7.006641 -2.303647 0.21732
H  -7.18798 1.933471 -0.820756
H  -8.339623 -0.227025 -0.348173
H  6.064705 -1.978212 1.363199
H  5.455568 -3.581273 1.887381
H  6.937571 -3.465044 0.895276
H  5.815758 -3.079996 -2.231683
H  5.179254 -4.669361 -1.696965
H  6.779618 -4.108471 -1.133828
H  2.263354 3.565762 2.533449
H  2.066281 2.513229 -1.672704
H  3.713895 5.554626 1.963387
H  3.486462 4.482272 -2.244138
H  4.315172 6.011908 -0.433736
