program: Gaussian 09
title: 000178363
version: EM64L-G09RevD.01
frameworkgroup: C1[X(C11H12O2)]
method: RPBEPBE
basis: SDD
operation: Freq
keyword: #pfreq=noraman
keyword: PBEPBE/SDD
title: #p freq=noraman PBEPBE/SDD
converged: YES YES NO NO
title: Mulliken charges:
elementType: O O C C C C C C C C C C C H H H H H H H H H H H H
charge: -0.276020 -0.261360 0.152466 0.235646 0.249474 -0.767479 -0.745705 0.224439 -0.381366 -0.490738 -0.443002 0.487196 -0.809550 0.235091 0.230126 0.234253 0.226649 0.236766 0.249990 0.237718 0.254395 0.230649 0.235638 0.229857 0.224868
chargesum: 0.00000
title: Mulliken charges with hydrogens summed into heavy atoms:
elementType: O O C C C C C C C C C C C
charge: -0.276020 -0.261360 0.152466 0.235646 0.249474 -0.068010 -0.032300 0.224439 -0.143648 -0.236343 -0.212353 0.487196 -0.119187
polarizability: 1.70931721e+02 1.27741148e+00 1.23388531e+02 -1.27466613e+00 -3.11748885e-01 7.22335056e+01
1716.lowfreq: 0.0001 0.0003 0.0006 5.8691 10.0018 12.8406 44.4433 91.4889 130.2631
frequency: 44.3526 91.4865 130.2559 147.1192 154.9181 197.1687 209.5242 225.0762 279.0145 309.1120 345.2050 402.1160 438.9480 455.3918 488.7710 516.0241 536.3540 574.7630 604.0266 632.3886 667.4445 732.0830 752.8200 778.8160 806.1467 821.2914 876.6734 879.9854 926.0897 949.7582 1001.0011 1037.3963 1046.9091 1049.8363 1089.7940 1095.1224 1121.8664 1142.1738 1175.1421 1241.1568 1276.0622 1322.9514 1381.8835 1390.9929 1395.5023 1399.9594 1408.5734 1442.7375 1452.9341 1462.9509 1470.2871 1471.2721 1474.1332 1478.0853 1490.3485 1598.6737 1634.7602 2977.9872 2989.3266 3004.0262 3056.6308 3077.1514 3087.3208 3099.0182 3100.3827 3113.9652 3128.9257 3150.8845 3156.5686
redmass: 1.0476 3.7386 2.8347 1.0355 1.0855 2.9629 2.6383 3.6178 4.0559 3.5204 3.2594 4.0456 3.6218 4.7312 5.4512 5.0370 5.3493 4.6777 3.6365 4.6996 5.1295 5.1521 5.2562 4.1732 3.3307 1.4666 2.2925 1.3857 3.2698 1.3550 1.4830 1.6253 1.5796 2.4438 1.9817 1.9505 2.0364 1.6556 1.9456 3.2253 1.6701 3.2315 2.9497 1.7121 1.3545 1.3559 2.4289 2.5293 1.0510 1.0718 1.0718 1.1572 1.1782 1.3071 2.5770 7.0702 7.9905 1.0374 1.0368 1.0362 1.0973 1.0988 1.0989 1.0992 1.0989 1.1000 1.0876 1.0961 1.0936
irintensity: 0.8147 4.0056 0.2010 0.3679 0.3489 1.3093 1.0919 1.1801 0.0128 1.4272 0.5984 6.4052 4.5401 2.5465 19.0262 0.2289 13.7467 2.8634 8.7001 6.9192 12.2969 4.5309 10.3464 50.3830 35.0325 18.1432 22.3089 14.5346 77.8580 1.3823 1.6130 4.8867 11.5111 6.5626 28.7522 43.0307 105.0048 2.9239 23.0516 5.8348 11.3890 13.5649 40.8494 17.1938 14.2989 2.6099 63.8678 4.2992 9.6095 5.1145 26.5756 11.7335 37.5175 12.1425 13.0244 11.9381 68.9871 35.1366 16.4726 14.3798 19.7183 15.4179 19.7288 13.3715 15.1567 13.6874 9.3026 23.0218 2.0145
temp: 298.150 k
press: 1.00000 atm
elementType: 8 8 6 6 6 6 6 6 6 6 6 6 6 1 1 1 1 1 1 1 1 1 1 1 1
symmnumber: 1
zpe: 523173.7 jmol-1
zpe.correction: 0.199266 hartree
zpe.thermalcorrener: 0.211607 hartree
zpe.thermalcorrenthalpy: 0.212551 hartree
zpe.thermalcorrgfe: 0.161112 hartree
zpe.sumelectzpe: -575.840978 hartree
zpe.sumelectthermal: -575.828637 hartree
zpe.sumelectthermalent: -575.827693 hartree
zpe.sumelectthermalfe: -575.879132 hartree
dipole: 0.4594 1.2994 -2.3124
dipole: 2.6920
quadrupole: -63.7815 -71.0741 -82.6499
quadrupole: -1.4350 5.6170 -0.3168
quadrupole: 8.7203 1.4278 -10.1481 -1.4350 5.6170 -0.3168
hfenergy: -576.0402443 hartree
pointgroup: C01 [X(C11H12O2)]
dipole: -0.2025008 -0.4931073 -0.9151812 debye
dipolederiv: -0.7809807 -0.0265903 -0.0290059 0.0304685 -0.4417882 -0.0086045 -0.3870973 0.0367481 -0.6884329 -1.4516888 -0.1462009 -0.0137139 -0.1891232 -0.5588855 0.0753349 0.1241392 0.0313365 -0.2763008 0.6101893 -0.2280591 -0.0341729 -0.1849301 0.2402585 0.086644 0.1662672 0.1910521 0.3327892 1.19303 0.0474545 -0.0203812 -0.1943609 0.5380599 -0.0965167 0.0060037 -0.2116044 0.4740945 -0.264404 0.1671133 0.0328853 -0.249925 -0.273977 -0.0326308 0.1852008 -0.0574508 -0.1145252 -0.0877242 0.0743903 0.0324063 0.0688809 -0.0532845 -0.0744362 0.0039077 -0.0493745 0.0298641 -0.1697504 -0.0511559 0.0692067 -0.0872224 -0.0112598 0.0523678 0.0262991 0.0116991 0.0224228 0.8443248 0.260604 -0.0135331 0.6316486 0.3230859 -0.0105121 -0.0280304 0.0154624 0.0945561 0.2489407 -0.0749892 -0.0105858 0.0931459 0.1253838 0.0116783 -0.0256795 0.0001556 -0.1140917 -0.4256433 -0.1276525 0.0053653 -0.0739056 0.0314781 0.000834 -0.0017804 0.0106283 -0.1985406 -0.2623172 0.1288526 0.0041798 0.2805665 -0.1250719 -0.0025984 0.0081185 -0.00454 -0.200128 0.4008008 -0.0528331 -0.0143157 -0.1950585 0.1824899 0.0080457 -0.04539 0.008019 -0.0204257 -0.1115831 0.0686711 0.0095343 0.1525525 0.0389451 -0.0021061 0.0468929 -0.0121607 0.0613494 0.0908196 -0.0538754 0.0545923 -0.0038161 -0.0715316 0.061745 0.0247777 0.1016472 0.0301205 0.0918074 -0.0043694 -0.0655294 0.0081724 0.0578477 -0.0354225 -0.0413665 -0.062561 -0.0919838 -0.136128 0.0051571 0.0108986 -0.0521951 0.0899787 -0.013893 -0.0170937 -0.009679 0.103788 -0.0259277 0.0711485 0.0182501 0.1363529 0.0064827 -0.0019254 0.0093889 0.0144545 0.1008272 0.0805266 0.0014756 -0.0465262 -0.0215406 0.0718372 0.0610266 -0.0003029 0.0823043 -0.0782947 0.067719 -0.0489846 0.0042159 -0.0864797 -0.0285425 -0.0684338 -0.0339619 -0.0965474 0.0297676 0.0793772 0.0644184 0.0015907 0.0433467 -0.0875562 -0.0056313 -0.0078502 -0.0005101 0.145597 0.085045 0.0361146 0.0030392 0.0479671 -0.0525969 -0.0029564 0.003578 0.000533 0.1685015 -0.0621372 -0.1082955 -0.0004256 -0.0991828 0.0053017 -0.000937 0.0022767 -0.0037615 0.1603989 -0.0019119 0.0302755 0.0186514 0.050477 0.054558 -0.0975168 0.0852904 -0.0988754 -0.0635367 0.0124219 0.0211539 -0.0059952 0.0628806 -0.0037274 0.1199285 -0.0790383 0.1194301 -0.0136444 -0.0248058 -0.0538234 -0.0106312 -0.1687197 -0.0574856 -0.023484 -0.0245498 -0.0164053 0.1058275 unknown
polarizability: 170.9618404|0.9060421|123.3433879|-0.6196576|1.2181296|72.2485293 unknown
InChI: InChI=1S/C11H12O2/c1-7-4-5-8-9(6-7)12-11(3)10(8,2)13-11/h4-6H,1-3H3
charge 0 multiplicity 1
25 atoms
O  2.104794 -0.080046 1.208975
O  0.823483 1.552052 -0.140769
C  1.522399 -0.771058 -0.092111
C  1.998265 0.665474 -0.06929
C  0.036927 -0.672102 -0.099685
C  2.290075 -1.972489 -0.572177
C  3.229388 1.321614 -0.62088
C  -0.311383 0.705513 -0.08818
C  -0.984335 -1.637103 -0.108568
C  -1.634864 1.154368 -0.057219
C  -2.33332 -1.203454 -0.091671
C  -2.670452 0.177659 -0.060274
C  -4.123926 0.61846 -0.023942
H  2.056157 -2.856018 0.048794
H  2.028185 -2.209041 -1.619719
H  3.376475 -1.795386 -0.51056
H  4.068082 0.606902 -0.638036
H  3.047199 1.694973 -1.642536
H  3.515286 2.175516 0.017895
H  -0.74851 -2.707011 -0.121125
H  -1.864949 2.224234 -0.038733
H  -3.139179 -1.94598 -0.094274
H  -4.36595 1.115376 0.934702
H  -4.346072 1.342242 -0.829884
H  -4.808776 -0.238695 -0.139632
