program: Gaussian 09
title: 000178367
version: EM64L-G09RevD.01
frameworkgroup: C1[X(C13H16O4)]
method: RPBEPBE
basis: SDD
operation: Freq
keyword: #pfreq=noraman
keyword: PBEPBE/SDD
title: #p freq=noraman PBEPBE/SDD
converged: YES YES NO NO
title: Mulliken charges:
elementType: O O O O C C C C C C C C C C C C C H H H H H H H H H H H H H H H H
charge: -0.265563 -0.286248 -0.419446 -0.224183 0.172274 0.132539 0.243155 0.199822 -0.733852 -0.695388 -0.398355 -0.496348 0.359541 -0.391135 -0.539394 0.106363 -0.791476 0.254591 0.225780 0.247416 0.232911 0.260766 0.222340 0.261891 0.260977 0.364626 0.277227 0.226651 0.217876 0.235418 0.238700 0.239452 0.261075
chargesum: 0.00000
title: Mulliken charges with hydrogens summed into heavy atoms:
elementType: O O O O C C C C C C C C C C C C C
charge: -0.265563 -0.286248 -0.054821 -0.224183 0.172274 0.132539 0.243155 0.199822 -0.006066 0.020629 -0.136464 -0.235371 0.359541 -0.113908 0.140551 0.106363 -0.052249
polarizability: 2.23473652e+02 1.39108050e+00 1.50179345e+02 2.28045053e+00 8.26450817e-01 9.84851199e+01
1716.lowfreq: -10.0858 -0.0004 0.0004 0.0005 5.4584 11.7146 42.7054 54.5516 64.8367
frequency: 42.4436 54.5040 64.8289 105.9363 147.2013 155.0662 156.7058 176.1031 186.1352 210.1990 233.6713 235.0775 260.9048 279.8081 299.5008 316.8369 337.9898 341.3202 357.0702 391.2320 409.9412 440.9656 455.0698 506.4819 524.1064 536.1323 568.4383 580.1098 615.3334 642.9277 651.0041 709.7453 741.0276 765.2826 811.9814 851.3940 856.2972 875.0434 899.6126 931.0853 946.4652 981.7511 995.9172 1025.3050 1027.8970 1059.3506 1069.2817 1075.5328 1085.4728 1111.1298 1119.7878 1143.4427 1157.7621 1176.9884 1201.7375 1239.4016 1275.8455 1289.3173 1339.3824 1365.6916 1381.3188 1391.6472 1393.5431 1421.5123 1430.8357 1448.2258 1449.9729 1452.0152 1461.0745 1461.6023 1466.0358 1472.5126 1483.5949 1488.4292 1575.8230 1607.5673 1624.0094 2959.2216 2985.4474 2998.4633 3002.6418 3046.0706 3070.3836 3096.1244 3104.1068 3104.9826 3115.3503 3116.0324 3125.0419 3149.9794 3169.3719 3173.2067 3558.9536
redmass: 3.8845 4.4722 5.0396 3.3860 3.7035 1.3525 2.0530 1.2915 2.6811 1.9003 1.4825 1.6353 1.9484 2.4741 2.4918 3.1566 2.3096 3.9364 2.3468 3.6151 3.1048 3.6388 3.4971 5.2178 3.9022 3.6387 5.1479 4.3334 4.4805 4.7931 3.5619 5.8732 3.9413 4.5278 2.9223 2.5918 1.4045 1.4993 5.1450 2.1346 2.0231 1.3656 4.0087 1.8483 2.3912 1.8460 1.8228 2.2206 2.8170 1.3105 1.6087 1.7071 1.5029 3.4816 3.4478 2.2107 1.7402 5.7543 1.8754 1.2896 1.2151 1.3000 4.3343 4.9263 1.1231 1.1031 1.0644 1.0560 1.0650 1.0501 1.0697 1.0657 2.0844 1.2412 7.8331 8.2421 7.9523 1.0318 1.0373 1.0369 1.0354 1.1031 1.0969 1.0988 1.1002 1.1006 1.0998 1.0997 1.0993 1.0885 1.0951 1.0931 1.0653
irintensity: 2.2151 1.4295 3.2138 1.3610 4.0684 1.7012 1.0203 0.2659 0.6043 4.1951 0.5795 1.6916 12.9810 25.4953 3.7522 8.2296 44.6234 4.0696 33.6517 10.9882 36.4248 4.3914 27.5582 5.2982 0.9548 7.9691 2.8896 8.5985 18.2834 13.7712 11.7240 17.3298 9.8488 67.4295 3.0875 22.2546 26.3549 28.7124 97.8381 52.5771 18.9370 1.0821 36.4789 1.4795 19.2765 37.6103 171.1131 95.3273 75.9147 6.9098 17.1377 19.1549 20.0062 52.2578 86.6293 77.9858 36.1283 209.8915 13.0918 59.4631 33.6983 17.2999 18.9088 44.9148 1.4500 36.8107 5.2963 8.3254 18.7518 20.2098 9.8636 8.4848 21.3306 7.7632 192.0675 6.2465 25.4339 65.8576 3.5258 15.6864 10.6121 51.1205 12.3547 12.0993 22.7611 17.9988 1.2933 35.1850 18.0584 1.9866 7.1204 0.3755 16.3325
temp: 298.150 k
press: 1.00000 atm
elementType: 8 8 8 8 6 6 6 6 6 6 6 6 6 6 6 6 6 1 1 1 1 1 1 1 1 1 1 1 1 1 1 1 1
symmnumber: 1
zpe: 689031.5 jmol-1
zpe.correction: 0.262438 hartree
zpe.thermalcorrener: 0.279754 hartree
zpe.thermalcorrenthalpy: 0.280698 hartree
zpe.thermalcorrgfe: 0.218423 hartree
zpe.sumelectzpe: -804.583688 hartree
zpe.sumelectthermal: -804.566372 hartree
zpe.sumelectthermalent: -804.565428 hartree
zpe.sumelectthermalfe: -804.627703 hartree
dipole: 4.7682 2.5265 -0.1483
dipole: 5.3982
quadrupole: -102.1489 -94.1488 -102.1852
quadrupole: -10.5526 -3.4749 -3.7568
quadrupole: -2.6546 5.3455 -2.6909 -10.5526 -3.4749 -3.7568
hfenergy: -804.8461259 hartree
pointgroup: C01 [X(C13H16O4)]
dipole: 1.8869495 0.9739512 -0.0386857 debye
polarizability: 223.5129934|0.5052938|150.0702476|1.7769652|2.2625224|98.5548763 unknown
InChI: InChI=1S/C13H16O4/c1-8(14)9-5-6-10-11(7-9)17-13(3,15)12(10,2)16-4/h5-7,15H,1-4H3
charge 0 multiplicity 1
33 atoms
O  0.807286 1.778813 0.239524
O  2.524208 -1.299265 -0.79718
O  3.123517 1.618067 0.848846
O  -4.635504 -1.029061 -0.203289
C  1.905074 -0.43751 0.220415
C  2.156959 1.105149 -0.069471
C  0.394206 -0.526586 0.050315
C  -0.16486 0.767521 0.131165
C  2.302115 -0.832083 1.660618
C  2.471344 1.449048 -1.527708
C  -0.43879 -1.648707 -0.084949
C  -1.548394 0.990867 0.097661
C  -2.396796 -0.146679 -0.029264
C  -1.837324 -1.452786 -0.129334
C  3.968292 -1.534415 -0.646597
C  -3.895213 -0.009688 -0.072635
C  -4.512197 1.381484 0.045025
H  1.743487 -0.216771 2.384884
H  2.049444 -1.894052 1.827036
H  3.374398 -0.667059 1.849464
H  3.472856 1.08561 -1.810302
H  1.735633 0.98387 -2.202813
H  2.430543 2.545654 -1.662256
H  -0.004524 -2.649835 -0.167668
H  -1.945683 2.00707 0.163492
H  3.272653 2.581475 0.670909
H  -2.527466 -2.294688 -0.240958
H  4.185725 -2.197013 0.21252
H  4.537389 -0.5913 -0.528365
H  4.27265 -2.036823 -1.578445
H  -4.175587 2.036034 -0.780555
H  -4.219381 1.867682 0.994091
H  -5.60826 1.291074 0.008125
