program: Gaussian 09
title: 000178369
version: EM64L-G09RevD.01
frameworkgroup: C1[X(C17H17NO5)]
method: RPBEPBE
basis: SDD
operation: Freq
keyword: #p
keyword: freq=noraman
keyword: PBEPBE/SDD
title: #p freq=noraman PBEPBE/SDD
converged: YES YES NO NO
title: Mulliken charges:
elementType: O O O O O N C C C C C C C C C C C C C C C C C H H H H H H H H H H H H H H H H H
charge: -0.250135 -0.286229 -0.260778 -0.277472 -0.330486 -0.503755 0.395067 -0.001832 -0.484019 0.235987 0.361732 -0.306510 0.126946 -0.379697 -0.345442 -0.292566 0.219703 0.335597 -0.360484 -0.388603 -0.535722 -0.497845 -0.537258 0.339390 0.378941 0.269939 0.245263 0.274219 0.246661 0.243352 0.252650 0.223973 0.250084 0.223878 0.243238 0.242859 0.233129 0.224820 0.224810 0.246595
chargesum: 0.00000
title: Mulliken charges with hydrogens summed into heavy atoms:
elementType: O O O O O N C C C C C C C C C C C C C C C C C
charge: -0.250135 -0.286229 -0.260778 -0.277472 -0.330486 -0.124814 0.395067 -0.001832 -0.144629 0.235987 0.361732 -0.036571 0.126946 -0.134434 -0.071223 -0.045906 0.219703 0.335597 -0.117133 -0.135953 0.162213 0.221381 0.158967
polarizability: 3.81962089e+02 1.84386873e+01 2.57716694e+02 1.35779481e-01 -1.40272961e-01 9.59021305e+01
1716.lowfreq: -0.0007 -0.0002 0.0005 2.4548 5.9553 6.3795 26.8228 27.9495 53.1252
frequency: 26.7451 27.8691 53.1247 57.4253 73.3432 81.9238 96.8822 106.5451 126.8531 134.6040 141.7448 149.7007 156.8545 191.6908 219.2928 225.8450 244.3720 256.2680 273.8344 310.0514 311.3201 326.6552 333.1089 346.3006 389.7582 413.8025 460.0570 470.1758 502.4075 506.8506 529.8875 565.4344 600.6961 618.1771 628.6817 630.9774 679.7243 684.8157 725.1022 752.9438 756.5511 760.7720 779.1230 811.8160 818.2219 842.9847 862.8566 896.0532 906.8881 931.3016 932.3869 965.4120 966.4657 984.7233 987.8529 1000.6756 1007.5755 1057.5476 1089.8853 1111.1249 1111.6028 1114.0888 1119.7106 1144.9113 1149.5506 1155.0196 1159.7146 1181.9560 1195.7771 1232.4558 1243.7051 1264.4885 1275.7490 1291.2747 1322.6136 1373.4992 1393.1846 1422.4020 1426.8956 1434.6514 1436.8636 1447.2195 1452.5680 1464.0070 1468.1703 1468.3506 1468.8464 1470.9356 1473.3647 1500.7347 1513.4900 1554.6141 1570.1221 1582.8069 1613.9760 1625.9828 1651.2192 2965.3974 2966.0126 3005.2662 3055.4517 3056.9686 3107.2220 3129.0109 3130.9183 3132.8784 3147.6896 3148.7980 3162.9996 3166.0970 3170.0904 3183.6993 3195.3029 3277.5763
redmass: 3.5128 5.7865 5.5114 5.5215 3.7266 3.7538 4.0795 1.2738 4.1662 5.1208 3.5094 5.5316 3.5381 4.2794 1.2121 1.2836 3.6958 3.0794 5.1244 4.9499 6.1602 5.0750 7.7967 5.4712 6.6778 2.9247 3.1741 6.1845 4.7467 2.9086 4.9284 6.7911 5.4659 6.7017 5.2563 7.0203 4.2620 4.0241 6.5701 3.5736 6.0224 4.5151 6.1420 1.5462 1.3034 1.7943 7.2355 1.1957 6.6628 1.4314 7.6188 1.3401 1.3299 8.9178 1.3504 2.9025 3.3222 5.5624 3.4293 1.2587 1.2600 1.2593 1.3493 1.4506 1.4851 1.6935 1.3395 1.3294 1.9762 2.1052 2.5867 4.1012 2.3742 2.1870 1.4424 5.2097 6.2354 1.5007 3.8899 1.2780 1.2170 2.3854 1.0497 1.1708 1.0498 2.2143 1.0514 1.1386 1.0806 2.6274 3.1692 7.7981 7.3667 5.5507 4.4690 5.7409 2.4791 1.0327 1.0327 1.0295 1.1041 1.1042 1.1046 1.0998 1.0998 1.0900 1.0877 1.1048 1.0875 1.0956 1.0957 1.0964 1.0928 1.0806
irintensity: 1.6337 3.2311 1.3137 0.1186 1.5806 0.1653 1.5630 0.0139 0.8186 14.0463 0.1009 5.0020 9.8151 3.8099 0.3538 0.2270 11.7083 0.9153 5.9361 0.2105 4.5075 0.2447 0.9543 26.3719 4.7819 0.1031 4.5613 6.4070 0.1467 10.6734 20.5807 32.0707 13.6964 7.6802 1.8873 7.3854 17.6906 18.6935 5.7424 12.2123 16.3271 0.6309 10.4392 35.5284 0.0139 41.3545 16.8669 101.0162 1.6915 46.0428 11.2409 2.0850 6.3534 58.8956 0.3900 15.5958 95.5577 112.8518 85.3572 0.2619 0.2122 0.0824 33.5940 35.3919 111.7077 106.8910 12.8081 346.7159 99.5430 87.1473 236.4667 487.2231 348.5687 182.2480 28.0227 10.4790 15.8885 117.3438 10.7011 18.0629 15.2955 57.4346 14.2130 11.3764 13.8555 125.3686 14.2399 35.8829 51.1368 556.2476 246.0914 120.4536 225.8967 91.0404 664.9100 23.9963 148.8093 94.2856 65.9244 43.6880 44.5224 44.5556 25.8712 26.4101 21.3386 1.7534 3.6290 18.7136 4.2068 11.8316 9.1512 7.3174 22.1770 185.1108
temp: 298.150 k
press: 1.00000 atm
elementType: 8 8 8 8 8 7 6 6 6 6 6 6 6 6 6 6 6 6 6 6 6 6 6 1 1 1 1 1 1 1 1 1 1 1 1 1 1 1 1 1
symmnumber: 1
zpe: 811546.4 jmol-1
zpe.correction: 0.309102 hartree
zpe.thermalcorrener: 0.331074 hartree
zpe.thermalcorrenthalpy: 0.332018 hartree
zpe.thermalcorrgfe: 0.256686 hartree
zpe.sumelectzpe: -1087.223363 hartree
zpe.sumelectthermal: -1087.201391 hartree
zpe.sumelectthermalent: -1087.200446 hartree
zpe.sumelectthermalfe: -1087.275779 hartree
dipole: -1.3790 2.0578 -0.0023
dipole: 2.4771
quadrupole: -77.4368 -122.7336 -138.2137
quadrupole: -7.4060 0.1012 -0.0470
quadrupole: 35.3579 -9.9389 -25.4190 -7.4060 0.1012 -0.0470
hfenergy: -1087.5324643 hartree
pointgroup: C01 [X(C17H17N1O5)]
dipole: -0.5496972 -0.803123 -0.0513365 debye
polarizability: 381.5060608|-19.811317|257.6931518|4.7192476|7.7010038|96.3817014 unknown
InChI: InChI=1S/C17H17NO5/c1-21-12-6-4-11(5-7-12)16(19)18-15-10-13(22-2)8-9-14(15)17(20)23-3/h4-10,18H,1-3H3
charge 0 multiplicity 1
40 atoms
O  -4.245409 2.838364 0.070804
O  -2.734264 -3.363106 -0.215455
O  6.212173 -0.520367 0.11906
O  0.419918 2.34841 0.135496
O  -0.566249 -2.544542 -0.141546
N  -0.258219 0.100564 0.000573
C  -1.659073 0.22549 -0.01755
C  -2.453473 -0.98538 -0.093673
C  -2.312024 1.478964 0.035495
C  2.134738 0.635066 0.083447
C  -3.72239 1.545593 0.013992
C  -3.868657 -0.873074 -0.112722
C  0.707964 1.109976 0.076302
C  -4.51802 0.367962 -0.060492
C  3.139465 1.632491 0.149128
C  2.537877 -0.731401 0.031242
C  -1.820769 -2.312687 -0.149569
C  4.889958 -0.063508 0.110933
C  4.507594 1.301808 0.16335
C  3.898522 -1.076417 0.044855
C  -5.70385 2.995423 0.052177
C  -2.146914 -4.721077 -0.274241
C  7.280239 0.482528 0.185278
H  -1.721321 2.394158 0.093109
H  0.052843 -0.885936 -0.048042
H  -4.45437 -1.794121 -0.170237
H  -5.609803 0.412771 -0.077549
H  2.814125 2.677299 0.189401
H  1.809454 -1.54864 -0.019559
H  5.25519 2.098752 0.214802
H  4.219896 -2.121394 0.00547
H  -6.138349 2.59602 -0.88418
H  -5.872538 4.08043 0.10689
H  -6.172208 2.499689 0.923903
H  -1.528437 -4.910692 0.618906
H  -1.521583 -4.829625 -1.176203
H  -3.01326 -5.39636 -0.308531
H  7.214357 1.077711 1.116347
H  7.251321 1.157787 -0.691422
H  8.215647 -0.095432 0.178813
