program: Gaussian 09
title: 000178432
version: EM64L-G09RevD.01
frameworkgroup: C1[X(C23H16N4O4S)]
method: RPBEPBE
basis: SDD
operation: Freq
keyword: #p
keyword: freq=noraman
keyword: PBEPBE/SDD
title: #p freq=noraman PBEPBE/SDD
converged: YES YES NO NO
title: Mulliken charges:
elementType: S O O O O N N N N C C C C C C C C C C C C C C C C C C C C C C C H H H H H H H H H H H H H H H H
charge: 0.359694 -0.215562 -0.268855 -0.207202 -0.194055 -0.215729 -0.431805 0.009506 0.021339 -0.093181 -0.748521 0.078000 0.633009 -0.217239 0.342852 -0.033758 -0.416347 -0.452005 -0.333762 0.189358 -0.329142 0.367222 -0.189571 -0.216981 -0.381629 -0.222091 0.264205 -0.334715 -0.356836 -0.224685 -0.235592 -0.223283 0.320198 0.310450 0.341334 0.308933 0.242357 0.292056 0.259329 0.240567 0.231955 0.290334 0.234152 0.276713 0.224407 0.236675 0.232220 0.235682
chargesum: 0.00000
title: Mulliken charges with hydrogens summed into heavy atoms:
elementType: S O O O O N N N N C C C C C C C C C C C C C C C C C C C C C C C
charge: 0.359694 -0.215562 -0.268855 -0.207202 -0.194055 -0.215729 -0.090471 0.009506 0.021339 0.227017 -0.438072 0.078000 0.633009 -0.217239 0.342852 -0.033758 -0.107414 -0.209649 -0.041706 0.189358 -0.069813 0.367222 0.050996 0.014973 -0.091295 0.012061 0.264205 -0.058002 -0.132430 0.011990 -0.003371 0.012400
polarizability: 4.65005434e+02 8.05787980e+00 2.98487938e+02 -6.76141673e+00 2.12682445e+01 2.15246290e+02
1716.lowfreq: -6.0101 -3.2762 -0.0015 -0.0007 -0.0004 2.3738 18.1760 22.3908 22.6761
frequency: 18.1219 22.2549 22.5927 26.1007 31.1859 42.9748 65.2972 75.3371 86.3425 93.4459 112.2252 129.6888 143.3563 162.5145 169.3484 178.9106 206.0708 239.3180 262.2457 264.9211 278.5711 310.2307 336.9691 347.6706 377.5022 394.1416 397.8840 403.7167 416.7688 423.5326 427.7787 437.4409 456.4543 501.9699 508.2411 524.8955 562.0101 571.3793 587.8093 591.0146 614.3111 618.6561 623.8953 641.2367 651.5198 664.0152 677.0957 680.4743 688.7888 697.6628 704.2236 742.2319 753.0174 762.0314 772.4152 775.8859 795.6199 817.2390 821.9086 857.0614 869.0784 880.9571 890.9594 923.4952 928.5514 939.5996 946.2745 956.5491 980.1322 987.3813 989.6521 989.8070 990.1962 999.6058 1008.5535 1011.7544 1018.7974 1025.4155 1070.3296 1085.2326 1087.2418 1092.4250 1097.7759 1150.1925 1157.7633 1161.1762 1171.4787 1175.3395 1176.3096 1182.8416 1191.4278 1206.5426 1212.7543 1224.4379 1233.3635 1261.3649 1288.1044 1289.2620 1303.9435 1318.5937 1339.6453 1348.4778 1375.7866 1386.4548 1395.4495 1401.8519 1432.4357 1437.5415 1439.1375 1457.2148 1462.2220 1465.0432 1478.5382 1486.4346 1568.5268 1590.5561 1592.2564 1601.1542 1606.3175 1611.4517 1616.5535 1619.8037 2959.3610 3039.8334 3125.0575 3134.4617 3135.6144 3140.6834 3148.5474 3159.3797 3160.6991 3161.9227 3172.1129 3178.0058 3183.7853 3188.6435 3202.0814 3492.0035
redmass: 5.5883 5.7811 5.5918 7.3930 7.1802 8.2517 9.5457 8.3371 6.0588 8.0255 8.5240 7.9701 6.3877 6.5049 5.7961 5.7495 7.5015 5.8549 5.2447 7.0112 6.3053 6.4752 5.9843 9.9750 8.4582 7.5658 5.5320 3.3641 5.2153 6.4041 3.7012 3.4251 4.0199 6.9212 6.1635 5.7640 8.1565 3.9195 1.6997 4.1023 6.0630 5.3652 7.0651 7.8871 7.6264 5.8613 7.6245 3.9083 4.2552 2.9220 1.5619 4.6952 7.5966 2.6153 1.7227 6.6727 2.4256 2.8993 2.1304 1.2502 7.1323 1.4011 6.2988 2.4088 2.5709 1.4306 1.4107 1.3762 4.3911 1.5020 1.3632 4.0503 6.0282 1.3689 1.3437 2.1276 3.8498 2.6686 3.0823 1.6645 1.7150 2.0812 2.3006 1.8740 1.7173 1.6046 3.1285 1.0582 1.2812 1.4771 1.1978 2.2563 2.9922 2.7385 2.3748 1.7353 1.5860 1.8946 1.3963 1.3313 1.4208 7.0129 11.2392 9.3087 5.8825 5.3019 2.2129 2.8407 2.5987 3.1040 2.1041 5.4848 2.7952 2.3479 6.6684 8.0729 6.4985 7.1811 6.8588 5.9960 7.1133 8.3188 1.0808 1.0864 1.0867 1.0893 1.0878 1.0868 1.0922 1.0927 1.0960 1.0932 1.1008 1.0975 1.0923 1.0966 1.0958 1.0761
irintensity: 1.2098 0.2612 0.5649 0.7216 0.3181 0.5906 1.2481 1.0748 0.7316 11.5269 0.6854 0.1308 2.0094 0.6649 3.3703 0.8465 2.9785 7.0813 1.0828 2.0905 14.5736 4.3972 12.2217 3.4580 3.9282 1.3870 3.4835 0.3990 21.7072 9.3784 1.6670 6.2927 0.9347 9.5825 20.9249 23.8971 10.2950 0.6017 58.3718 12.9213 2.5502 2.5760 3.3671 1.9705 4.8954 3.3624 24.0635 7.1740 5.1321 45.5505 105.4019 9.6729 3.8882 41.0472 69.6393 1.8790 15.2132 7.2847 22.5308 2.2300 5.0928 0.1511 0.4724 1.7658 10.8901 1.5498 2.3702 5.0410 13.9347 1.9909 0.1358 0.2264 0.6909 0.4170 1.2292 11.0409 22.6705 1.4494 10.6069 11.6216 34.5881 23.6674 2.9937 41.5089 22.5738 40.3579 42.1227 0.8251 7.4806 8.8495 16.3217 108.1484 105.6925 48.2460 48.5962 23.1768 31.5296 59.9371 12.5785 2.9652 24.4242 490.2830 115.6905 1.9208 79.0303 3.6806 48.3503 242.6098 14.6240 310.4868 100.8449 88.7001 29.3464 81.5062 150.9861 90.6337 9.0838 39.1217 9.8462 8.8670 0.3812 4.0854 46.3003 4.1568 6.9519 5.7267 3.0722 4.4923 19.4613 19.2585 13.6332 11.1621 21.2722 14.4532 6.3847 5.8676 3.2980 56.0184
temp: 298.150 k
press: 1.00000 atm
elementType: 16 8 8 8 8 7 7 7 7 6 6 6 6 6 6 6 6 6 6 6 6 6 6 6 6 6 6 6 6 6 6 6 1 1 1 1 1 1 1 1 1 1 1 1 1 1 1 1
symmnumber: 1
zpe: 911179.0 jmol-1
zpe.correction: 0.347050 hartree
zpe.thermalcorrener: 0.373211 hartree
zpe.thermalcorrenthalpy: 0.374155 hartree
zpe.thermalcorrgfe: 0.286971 hartree
zpe.sumelectzpe: -1801.753006 hartree
zpe.sumelectthermal: -1801.726845 hartree
zpe.sumelectthermalent: -1801.725900 hartree
zpe.sumelectthermalfe: -1801.813084 hartree
dipole: 1.2671 5.8497 5.7006
dipole: 8.2657
quadrupole: -182.6217 -196.2316 -188.0501
quadrupole: -13.8162 -17.0785 -8.7811
quadrupole: 6.3461 -7.2638 0.9177 -13.8162 -17.0785 -8.7811
hfenergy: -1802.1000553 hartree
pointgroup: C01 [X(C23H16N4O4S1)]
dipole: -0.5184533 2.0793374 -2.4460078 debye
polarizability: 465.44985|-3.5479071|293.7368997|-1.5572102|-28.4921176|219.5529127 unknown
InChI: InChI=1S/C23H16N4O4S/c28-21(14-7-2-1-3-8-14)25-19-20(15-9-6-10-16(13-15)27(30)31)32-23-24-17-11-4-5-12-18(17)26(23)22(19)29/h1-13,19-20,25H
charge 0 multiplicity 1
48 atoms
S  -1.468641 -2.457657 -0.030492
O  -2.021755 2.060783 -0.3531
O  1.928192 0.5762 1.404952
O  4.919046 -3.573404 1.340178
O  3.012961 -3.202322 2.534917
N  -2.974507 -0.038728 -0.056215
N  0.510891 1.214566 -0.322797
N  -4.190248 -1.992155 0.135531
N  3.693248 -3.178939 1.440404
C  -0.47321 0.194846 0.033913
C  -0.324706 -1.115103 -0.806404
C  -1.872977 0.825323 -0.143818
C  1.078402 -1.687686 -0.853123
C  -2.974907 -1.479208 0.028299
C  -4.353506 0.34804 -0.009098
C  -5.078026 -0.876387 0.13425
C  1.721191 -2.159113 0.316088
C  1.763252 -1.750442 -2.092425
C  -4.987757 1.600869 -0.06331
C  1.664533 1.372877 0.449335
C  -6.48203 -0.866576 0.235156
C  3.026159 -2.674045 0.210786
C  3.079374 -2.261358 -2.171548
C  -6.39998 1.595178 0.040606
C  3.72789 -2.730314 -1.012881
C  -7.133741 0.387123 0.186776
C  2.557061 2.5256 0.091125
C  3.513339 2.937304 1.054987
C  2.493819 3.195381 -1.159598
C  4.378373 4.016392 0.782616
C  3.363493 4.273276 -1.431695
C  4.303062 4.690046 -0.459893
H  -0.320594 -0.06991 1.10303
H  -0.692236 -0.944781 -1.833651
H  0.143518 2.0205 -0.840068
H  1.23816 -2.131366 1.295783
H  1.265335 -1.394238 -3.001745
H  -4.419301 2.524878 -0.179873
H  -7.035178 -1.803165 0.346521
H  3.5943 -2.296811 -3.136534
H  -6.938139 2.548345 0.005706
H  4.743373 -3.133729 -1.03478
H  -8.225377 0.429728 0.262554
H  3.559507 2.393576 2.004148
H  1.797414 2.863021 -1.938321
H  5.11014 4.331862 1.533896
H  3.314485 4.782198 -2.400368
H  4.976196 5.527824 -0.67262
