program: Gaussian 09
title: 000012869
version: EM64L-G09RevD.01
frameworkgroup: C1[X(C9H8ClN3O3)]
method: RPBEPBE
basis: SDD
operation: Freq
keyword: #p
keyword: freq=noraman
keyword: PBEPBE/SDD
title: #p freq=noraman PBEPBE/SDD
converged: YES YES NO NO
title: Mulliken charges:
elementType: Cl O O O N N N C C C C C C C C C H H H H H H H H
charge: 0.054790 -0.275797 -0.194924 -0.164115 0.080960 0.029698 0.010077 0.337025 0.143621 -0.402500 0.086637 0.320251 -0.487845 -0.753905 -0.243666 -0.499292 0.249293 0.241984 0.241628 0.261746 0.274188 0.215799 0.244997 0.229352
chargesum: 0.00000
title: Mulliken charges with hydrogens summed into heavy atoms:
elementType: Cl O O O N N N C C C C C C C C C
charge: 0.054790 -0.275797 -0.194924 -0.164115 0.080960 0.029698 0.010077 0.337025 0.143621 0.088777 0.086637 0.320251 -0.487845 0.023657 -0.243666 0.190856
polarizability: 1.90896851e+02 -1.51990158e+01 1.71465734e+02 -2.30858267e+00 -8.65159902e+00 7.81766857e+01
1716.lowfreq: -8.8733 -5.7698 -0.0026 -0.0021 -0.0014 0.8396 45.5798 56.2687 62.4677
frequency: 45.5687 56.2659 62.4651 89.8989 92.8573 127.2764 132.6897 142.6803 184.1508 193.4803 217.4013 238.9242 244.0597 265.1966 284.8792 305.5373 329.9317 400.9837 428.4640 454.6522 476.1898 496.1082 570.2214 599.4074 624.7483 655.3153 693.4337 716.3116 767.4562 779.0723 885.6706 919.3947 956.1679 1002.4203 1044.4365 1049.9651 1058.7534 1113.5054 1143.1013 1153.5707 1213.1097 1229.7601 1255.6369 1319.7030 1358.2486 1369.2949 1374.9629 1400.8526 1402.8982 1435.3383 1455.1542 1459.7208 1461.6111 1463.6717 1474.3671 1513.2724 1567.3155 2184.8456 2947.8939 2960.8814 3001.0793 3024.8778 3034.4873 3080.4686 3121.9316 3135.2190
redmass: 4.6899 5.0953 6.1300 7.5960 3.4214 1.8025 2.9303 2.2607 8.8281 4.5570 1.7300 4.0335 5.6417 4.6595 9.7364 9.0865 2.6570 5.6636 6.4853 8.3432 7.0149 6.3482 6.5812 9.9690 6.3966 6.3010 9.2230 10.9341 6.1209 8.2753 6.3198 5.6385 3.4796 2.0644 1.5913 2.3044 5.4500 1.2828 4.4936 1.5599 1.1654 10.8387 7.5881 5.1578 7.0983 5.1503 1.5491 1.9983 2.3831 1.1492 1.1756 1.0654 1.0840 1.0634 1.0765 5.7018 9.9261 12.6302 1.0336 1.0579 1.0383 1.1017 1.1044 1.0965 1.0990 1.0997
irintensity: 0.6585 1.5509 3.9097 1.4219 4.0480 3.9553 2.9908 1.4318 2.2548 1.2702 1.1257 3.5133 4.3234 5.6714 2.2823 3.3208 6.6220 2.0413 2.6631 6.4589 3.0712 5.7779 1.9068 12.8451 2.1890 0.7164 5.2842 23.8638 0.0550 4.5767 33.6861 38.5452 31.4218 6.9897 4.2427 11.9767 65.4820 2.1508 55.8081 2.2887 1.9996 190.5265 18.8701 21.5174 47.8712 58.4311 49.9651 29.7450 116.8788 4.4063 36.1725 13.1348 14.0838 9.5577 10.3266 64.1112 129.5380 7.6579 58.3487 20.2744 0.9955 23.1296 40.3693 5.4570 16.5641 6.3120
temp: 298.150 k
press: 1.00000 atm
elementType: 17 8 8 8 7 7 7 6 6 6 6 6 6 6 6 6 1 1 1 1 1 1 1 1
symmnumber: 1
zpe: 426164.9 jmol-1
zpe.correction: 0.162318 hartree
zpe.thermalcorrener: 0.178344 hartree
zpe.thermalcorrenthalpy: 0.179288 hartree
zpe.thermalcorrgfe: 0.118025 hartree
zpe.sumelectzpe: -1196.446311 hartree
zpe.sumelectthermal: -1196.430284 hartree
zpe.sumelectthermalent: -1196.429340 hartree
zpe.sumelectthermalfe: -1196.490604 hartree
dipole: -2.1173 0.6610 0.9271
dipole: 2.4041
quadrupole: -109.3954 -98.8985 -101.1754
quadrupole: 13.8202 -0.1897 -0.0564
quadrupole: -6.2390 4.2579 1.9811 13.8202 -0.1897 -0.0564
hfenergy: -1196.6086286 hartree
pointgroup: C01 [X(C9H8Cl1N3O3)]
dipole: -0.8347899 0.3430609 -0.2829262 debye
dipolederiv: -0.6399038 0.4148436 0.0177378 0.4146638 -0.3533237 -0.0103094 0.0245074 -0.0120692 -0.0286623 -0.4901163 0.2442688 0.0099771 0.2180057 -0.9235974 -0.116773 0.080622 -0.209774 -0.3966532 -0.5231165 0.1414323 -0.0752391 0.165478 -0.4888257 0.2264906 -0.0723927 0.1395099 -0.6025005 -0.6848903 0.0004781 0.2464494 0.0442398 -0.3049938 0.0803663 0.1676077 0.1850208 -0.5159842 -1.1320985 0.1533407 0.0740864 -0.1284428 -0.3583567 0.0246941 0.0838836 0.0093122 -0.1789763 1.2005546 -0.3058863 -0.1795573 -0.2920143 0.7063359 -0.3150841 -0.1201181 -0.2923618 0.9760733 -0.2543177 -0.0402808 0.0126241 -0.0320409 -0.2343811 0.004067 0.0056566 0.012232 -0.2162206 0.411114 -0.0388665 -0.0021387 -0.0371696 0.1927656 -0.0206603 -0.0798057 -0.0246398 0.0296998 -0.3484591 0.0125484 0.052688 -0.1680836 -0.3861696 0.0911475 0.0844802 0.0875976 -0.0456162 0.3430551 -0.0250793 -0.0521446 -0.047377 0.2819333 0.1099928 -0.1414629 0.3205156 0.3490995 0.7283277 0.2079904 -0.0768028 0.2308696 0.5905995 -0.0561159 -0.0197021 -0.1722633 0.0788224 -0.2448128 0.1412476 0.0159835 0.3224696 -0.3319045 0.0059729 -0.029903 0.0579861 0.1358938 1.3361867 -0.6689924 -0.0572449 -0.4493377 0.7867645 -0.0314113 -0.0773472 -0.0061845 0.037629 -0.3367529 -0.1996757 0.0620203 -0.1010395 -0.0130035 0.0250926 0.1262807 0.0891161 -0.0223323 0.1515412 0.1142923 -0.0275166 0.0515715 0.0795287 -0.0073555 -0.0045133 -0.0368868 0.0402949 0.3436553 -0.1901023 0.019187 -0.1629296 0.7105696 0.0546683 0.0828782 -0.033219 0.2028952 -0.1033493 -0.04039 0.0540686 -0.0333512 0.0364154 -0.0121002 0.0231692 -0.0608302 0.0573047 0.0455528 0.0600347 -0.0985441 0.0425977 0.0225134 0.0256945 0.0054176 -0.0497844 -0.0544649 0.028562 0.0076834 -0.0680656 0.0126179 0.0587076 0.0743571 -0.097285 0.0313848 0.0171078 0.1022475 0.0749489 0.0021512 -0.0065646 -0.0562901 -0.0086662 -0.0175226 -0.0358693 0.1323354 0.0981694 -0.0236514 0.0387525 -0.0246499 0.104352 -0.0623632 0.0235035 -0.0298089 0.0063492 -0.0665229 -0.1488601 0.0334814 -0.0419861 -0.1578363 0.0072995 0.0157118 0.0692481 0.090156 0.0541185 0.0778334 0.0897437 0.0340351 0.0283392 -0.0301591 0.0885695 -0.0725784 -0.0331825 -0.0187448 0.0308422 -0.0916972 -0.0115618 0.0098574 -0.0588451 -0.1522353 0.0343464 -0.059068 unknown
polarizability: 195.5884303|-8.256068|164.554188|-16.0370642|-8.0262906|80.3966524 unknown
InChI: InChI=1S/C9H8ClN3O3/c1-5-8(13(14)15)7(4-16-2)6(3-11)9(10)12-5/h4H2,1-2H3
charge 0 multiplicity 1
24 atoms
Cl 2.970654 -2.790052 -0.137137
O  -0.342182 2.441238 0.778692
O  -2.348957 1.196535 -1.058561
O  -2.89971 0.275009 0.955633
N  0.314922 -2.41511 0.07352
N  -2.096963 0.455592 -0.030081
N  3.931823 0.792347 -0.618328
C  0.396148 0.4061 -0.233172
C  -0.816444 -0.295499 -0.031071
C  0.410367 1.915549 -0.364577
C  -0.857856 -1.709042 0.121601
C  1.59389 -0.362884 -0.27135
C  1.46976 -1.775144 -0.109559
C  -2.123648 -2.500602 0.322416
C  2.872032 0.262612 -0.458349
C  -0.88049 3.784887 0.53032
H  1.447352 2.30221 -0.362819
H  -0.082994 2.202255 -1.317472
H  -2.903023 -2.229717 -0.412294
H  -1.890896 -3.571172 0.231402
H  -2.549764 -2.304328 1.322228
H  -0.070634 4.514106 0.327188
H  -1.408651 4.068347 1.452864
H  -1.591936 3.767165 -0.320295
