program: Gaussian 09
title: 000178350
version: EM64L-G09RevD.01
frameworkgroup: C1[X(C19H16ClNS)]
method: RPBEPBE
basis: SDD
operation: Freq
keyword: #p
keyword: freq=noraman
keyword: PBEPBE/SDD
title: #p freq=noraman PBEPBE/SDD
converged: NO NO NO NO
title: Mulliken charges:
elementType: Cl S N C C C C C C C C C C C C C C C C C C C H H H H H H H H H H H H H H H H
charge: -0.056313 0.207457 -0.093940 0.052070 0.352467 0.026418 0.359302 -0.295310 -0.155411 -0.256814 -0.365376 -0.370606 0.442847 -0.412406 -0.386123 -0.363385 -0.358271 -0.809908 -0.227905 -0.217042 -0.114692 -0.860524 0.234617 0.231664 0.213077 0.269286 0.229377 0.229463 0.219127 0.277546 0.226589 0.225670 0.237426 0.252775 0.254264 0.266968 0.268656 0.266960
chargesum: 0.00000
title: Mulliken charges with hydrogens summed into heavy atoms:
elementType: Cl S N C C C C C C C C C C C C C C C C C C C
charge: -0.056313 0.207457 -0.093940 0.052070 0.352467 0.026418 0.359302 -0.060693 -0.155411 -0.025149 -0.152299 -0.101319 0.442847 -0.183029 -0.156660 -0.144259 -0.080725 -0.120224 0.024870 0.037222 -0.114692 -0.057940
polarizability: 3.91928235e+02 -9.88873488e+00 3.25915425e+02 -2.59992157e+00 3.88147359e+00 9.91322968e+01
1716.lowfreq: -34.0368 -17.8860 -5.0835 -0.0024 -0.0015 -0.0012 1.8453 5.0539 21.4086
frequency: -33.9160 -17.8219 21.3489 39.5599 47.1018 52.8856 71.2034 92.7576 135.2683 154.1667 171.0475 185.9161 212.8829 224.4023 229.8810 259.0517 287.7528 308.9828 324.9839 354.3981 371.8304 404.0098 407.4466 427.6454 470.6258 475.0599 486.2592 541.7591 570.7369 572.2426 626.2202 637.2400 638.3324 669.3630 683.3071 717.2668 729.4285 735.4106 759.6895 792.2890 822.8136 829.1873 832.2650 840.3034 852.6252 861.7138 877.9668 951.1093 953.8267 960.9505 969.2852 985.2115 986.5296 990.3045 996.7376 997.7852 1008.2825 1039.2240 1047.0713 1075.1554 1103.5837 1108.9853 1123.2027 1128.7951 1185.7546 1196.9044 1225.4636 1245.4431 1293.3137 1304.5997 1309.3413 1318.3549 1338.2434 1349.1966 1360.7417 1391.2258 1395.5114 1396.7732 1410.0429 1416.3685 1455.3921 1462.2988 1470.5507 1471.3825 1481.4924 1510.5812 1534.3073 1558.7576 1577.4232 1579.2943 1600.1128 1623.5192 2973.6478 3007.3182 3054.8291 3085.3342 3118.4782 3122.0520 3124.6978 3133.9316 3142.1391 3145.6178 3157.9271 3160.4236 3168.3624 3169.6761 3178.1379 3180.7562
redmass: 1.0105 3.6124 3.7196 5.3193 4.8202 6.5087 4.8126 5.3063 5.0475 3.7823 4.2038 3.1406 7.7101 2.7344 1.7539 6.4983 4.5984 4.7139 5.3998 3.7433 5.8669 2.8300 2.8932 6.3652 4.0028 5.0950 3.0770 4.9386 4.7735 5.0223 6.9342 3.9527 6.3202 7.1060 7.9232 3.6904 2.7385 2.2983 6.5975 6.6589 1.3786 5.5780 1.4884 1.4920 1.3759 1.7366 1.5954 1.4284 5.8099 1.3677 1.1787 1.4105 1.4061 1.3204 3.6039 1.3699 3.3143 3.8229 1.5777 2.6807 1.4682 1.6801 2.0693 1.4868 1.1656 1.1398 3.1065 1.7011 1.2883 1.8469 3.1216 2.8241 3.2340 1.3211 3.4389 6.4779 3.5316 1.2380 3.3088 3.2133 1.0520 1.0623 1.0793 1.0921 2.5923 2.8466 8.6577 4.4699 6.5285 7.3832 6.2911 6.3709 1.0390 1.0293 1.0944 1.0999 1.0878 1.0898 1.1063 1.1019 1.0881 1.0955 1.0889 1.0907 1.0961 1.0937 1.0957 1.0909
irintensity: 0.4971 0.0209 0.0114 1.3648 1.6008 0.3495 0.1363 1.4102 0.0051 0.7963 0.3983 2.1346 0.1595 0.3361 0.1844 2.3965 0.2525 0.8028 5.1505 1.2359 2.8247 0.0396 0.2334 5.4968 7.4042 15.8607 16.6047 3.0390 22.9514 17.9562 0.4050 0.1340 0.7221 0.9624 6.1661 0.5984 0.2539 4.0941 39.9382 39.8036 19.8584 16.9071 75.3563 39.8396 15.3033 4.1208 1.0603 0.0802 1.5075 0.9146 9.9877 1.7053 4.2205 3.1596 43.2213 2.2700 6.9385 18.9669 23.2536 47.3441 14.1830 15.7457 0.2379 4.4007 16.5447 26.4394 0.4023 27.5608 1.4894 0.3775 7.5551 1.7267 0.2169 3.5331 5.7924 13.8557 80.5275 12.5658 48.6809 29.2483 16.7505 49.0368 8.0950 6.1744 101.0652 49.6746 274.9094 272.7267 7.6933 21.0076 25.4970 18.1778 42.3146 19.9057 23.5201 16.5365 18.6164 28.4310 15.9124 7.4681 10.1299 14.9713 1.1059 6.7960 5.4602 5.2755 4.3410 5.1488
temp: 298.150 k
press: 1.00000 atm
elementType: 17 16 7 6 6 6 6 6 6 6 6 6 6 6 6 6 6 6 6 6 6 6 1 1 1 1 1 1 1 1 1 1 1 1 1 1 1 1
symmnumber: 1
zpe: 763327.5 jmol-1
zpe.correction: 0.290736 hartree
zpe.thermalcorrener: 0.309597 hartree
zpe.thermalcorrenthalpy: 0.310541 hartree
zpe.thermalcorrgfe: 0.241480 hartree
zpe.sumelectzpe: -1644.980540 hartree
zpe.sumelectthermal: -1644.961679 hartree
zpe.sumelectthermalent: -1644.960735 hartree
zpe.sumelectthermalfe: -1645.029796 hartree
dipole: 1.3130 2.4828 0.0282
dipole: 2.8087
quadrupole: -135.9197 -122.8458 -150.7188
quadrupole: -19.5715 -0.5911 1.0895
quadrupole: 0.5750 13.6490 -14.2240 -19.5715 -0.5911 1.0895
hfenergy: -1645.2712761 hartree
pointgroup: C01 [X(C19H16Cl1N1S1)]
dipole: -0.4384557 -1.007841 0.1144321 debye
polarizability: 393.094952|-4.6340969|321.9192249|0.4619176|-25.493461|101.9617795 unknown
InChI: InChI=1S/C19H16ClNS/c1-13-3-5-14(6-4-13)18-11-17(22-2)12-19(21-18)15-7-9-16(20)10-8-15/h3-12H,1-2H3
charge 0 multiplicity 1
38 atoms
Cl 6.107931 2.845727 -0.271683
S  -0.234118 -4.577261 0.493846
N  -0.12426 0.056182 0.092407
C  -1.309562 -0.633067 0.166455
C  -2.561539 0.178588 0.104901
C  1.05776 -0.629358 0.148169
C  2.30392 0.192368 0.059195
C  -1.334182 -2.046239 0.29383
C  -0.113548 -2.758213 0.344021
C  1.102891 -2.045214 0.271525
C  -3.855605 -0.407353 0.155183
C  -2.477835 1.592989 -0.011574
C  -4.933137 1.803348 -0.024401
C  -5.015108 0.39113 0.089949
C  -3.639245 2.385816 -0.07671
C  3.591984 -0.337654 0.344459
C  2.210701 1.559394 -0.320652
C  -6.18384 2.662832 -0.064154
C  4.750025 0.461498 0.247558
C  3.35716 2.371284 -0.425573
C  4.617913 1.809289 -0.140839
C  1.561743 -5.11863 0.504134
H  -2.282324 -2.587638 0.347777
H  2.061526 -2.566024 0.291665
H  -3.97422 -1.492712 0.242544
H  -1.482265 2.043886 -0.048552
H  -6.001205 -0.088143 0.126983
H  -3.544615 3.474923 -0.169761
H  3.711002 -1.377026 0.666997
H  1.217722 1.966197 -0.529827
H  -6.026393 3.578251 -0.661287
H  -7.040423 2.114532 -0.493937
H  -6.477258 2.983464 0.954937
H  5.736237 0.046552 0.47578
H  3.274413 3.420538 -0.7242
H  2.087031 -4.709739 1.381719
H  2.067037 -4.828248 -0.43017
H  1.532285 -6.216767 0.576688
