program: Gaussian 09
title: 000178355
version: EM64L-G09RevD.01
frameworkgroup: C1[X(C22H13F6NO)]
method: RPBEPBE
basis: SDD
operation: Freq
keyword: #p
keyword: freq=noraman
keyword: PBEPBE/SDD
title: #p freq=noraman PBEPBE/SDD
converged: YES YES NO NO
title: Mulliken charges:
elementType: F F F F F F O N C C C C C C C C C C C C C C C C C C C C C C H H H H H H H H H H H H H
charge: -0.166203 -0.164287 -0.164520 -0.166471 -0.162983 -0.165748 -0.247651 -0.095999 0.065037 0.046916 0.372329 0.368484 -0.422422 -0.446861 0.381225 -0.481242 0.293506 -0.360999 -0.359286 -0.368265 0.288327 -0.364743 -0.341037 -0.345420 -0.228924 0.240935 0.250377 -0.364048 0.194100 -0.441101 0.256235 0.248280 0.304742 0.226235 0.284130 0.233392 0.262907 0.265349 0.266528 0.238970 0.242755 0.244632 0.282820
chargesum: 0.00000
title: Mulliken charges with hydrogens summed into heavy atoms:
elementType: F F F F F F O N C C C C C C C C C C C C C C C C C C C C C C
charge: -0.166203 -0.164287 -0.164520 -0.166471 -0.162983 -0.165748 -0.247651 -0.095999 0.065037 0.046916 0.372329 0.368484 -0.166187 -0.198580 0.381225 -0.176499 0.293506 -0.134764 -0.075156 -0.134873 0.288327 -0.101835 -0.075688 -0.078892 0.010046 0.240935 0.250377 0.123339 0.194100 -0.158281
polarizability: 3.54675769e+02 -4.69004952e+00 3.55812223e+02 1.65792331e+01 6.92217582e+00 1.18734351e+02
1716.lowfreq: -4.9145 -2.3311 0.0005 0.0007 0.0010 3.2664 11.4203 13.0227 20.3640
frequency: 11.3767 12.9756 20.2429 26.8044 34.2457 35.4521 48.8779 58.3831 73.4169 98.1683 109.7250 123.6035 134.3733 157.4393 160.9846 198.1331 217.3764 225.1166 228.9759 238.0729 250.6880 302.4280 312.2094 324.3079 334.8577 358.0586 361.7413 368.6787 399.6589 404.2112 420.8786 427.8031 450.9934 454.2999 469.1691 514.4660 522.5526 555.3458 564.2989 578.9106 603.5401 609.1805 618.0978 624.1456 633.5851 644.6611 650.7909 668.4217 691.4146 701.1923 708.5599 733.9136 740.7319 752.5528 815.1813 838.7005 844.8083 847.0590 868.3676 874.2879 877.9069 929.7843 953.1409 955.4070 958.2261 968.1078 981.6693 988.5180 989.6429 990.1684 991.8887 992.1929 995.3221 999.8845 1016.5637 1023.1693 1029.5383 1041.3196 1063.7166 1108.0014 1120.3740 1133.5614 1171.4746 1191.9178 1199.0194 1204.9184 1226.1016 1279.8939 1282.9294 1300.9307 1306.8009 1319.3591 1336.1912 1352.8929 1371.9119 1381.4884 1401.1679 1405.7832 1418.8377 1453.1249 1465.2082 1483.4514 1510.8532 1549.5145 1576.5430 1585.8025 1597.9806 1618.2531 1625.1069 2162.9504 2957.9782 3014.5010 3142.2643 3144.0403 3158.2439 3159.2015 3169.8614 3174.5790 3178.8095 3180.5939 3181.7131 3183.4443 3425.5765
redmass: 8.2710 14.9863 14.9628 8.2910 7.7087 4.0524 7.4888 6.5499 3.8555 6.6810 4.4817 7.9973 5.4800 7.2140 6.8301 7.5182 5.8410 7.7520 5.5107 6.5526 6.9089 6.6933 7.2121 3.1805 9.1721 8.4143 8.1988 8.4219 6.0512 3.1707 6.2607 4.9802 6.7151 6.9531 5.9439 11.0552 9.4856 4.8065 5.4625 5.1774 9.1225 10.7945 8.1463 4.0187 6.9359 1.2315 8.3815 4.3042 1.2614 1.9024 8.7869 3.7690 6.2464 3.2509 1.6114 1.5355 1.6969 4.5884 3.1523 2.2361 1.7245 1.4226 3.1081 5.7619 2.4500 1.6259 5.0924 5.8603 1.6285 5.0369 1.4391 3.5197 3.6796 1.8231 6.0221 7.6690 3.0171 3.7181 2.1832 1.7571 2.0213 1.4968 2.0682 1.1040 1.1321 1.0533 1.8710 2.5089 4.2401 1.5657 1.4134 3.6463 2.1948 3.3989 2.5049 5.6080 7.0612 4.0642 3.4422 2.7177 1.2453 2.7482 2.8702 8.6244 5.4585 7.2225 6.0985 6.5593 6.3338 5.9878 1.0546 1.1058 1.0869 1.0883 1.0924 1.0895 1.0960 1.0977 1.0929 1.0919 1.0953 1.0923 1.1620
irintensity: 0.3025 0.1091 0.0743 0.0699 0.1455 0.0477 0.4892 0.6748 2.6954 1.6048 0.4972 0.6608 0.5429 0.3704 0.0557 1.3822 0.7304 0.9245 5.5750 5.8101 4.8828 1.0119 1.2700 8.3662 3.6482 1.2964 3.1553 5.4920 10.5749 1.5446 2.4529 0.2508 11.8236 0.9780 3.7403 0.3645 0.1185 3.6720 4.2192 4.9769 12.6432 20.2917 1.6068 10.1556 0.3733 72.8484 9.3111 0.4894 52.4778 32.3187 3.0919 9.7127 16.3306 4.1418 60.0208 75.7904 1.0996 59.4342 18.6996 61.2961 24.2186 7.5246 59.7244 1.5220 43.4466 48.0331 196.9023 49.7058 2.8374 98.0569 6.2282 146.1801 65.8076 29.1512 154.4785 172.3305 92.3801 181.8399 2.3094 24.1641 14.7844 1.0103 348.4712 23.2322 0.3767 0.6057 36.9868 94.4274 511.7476 34.1574 4.4794 47.5143 191.7910 6.8477 8.0427 11.9194 21.6326 48.6530 7.6081 59.7768 0.8920 10.2295 6.7511 197.2537 251.5558 111.0615 2.7049 8.9329 35.7380 6.0804 18.9305 16.0740 6.9549 7.9843 6.7009 0.6949 3.1497 5.7135 6.3899 9.4932 1.8311 2.1990 78.2505
temp: 298.150 k
press: 1.00000 atm
elementType: 9 9 9 9 9 9 8 7 6 6 6 6 6 6 6 6 6 6 6 6 6 6 6 6 6 6 6 6 6 6 1 1 1 1 1 1 1 1 1 1 1 1 1
symmnumber: 1
zpe: 765716.6 jmol-1
zpe.correction: 0.291646 hartree
zpe.thermalcorrener: 0.318247 hartree
zpe.thermalcorrenthalpy: 0.319191 hartree
zpe.thermalcorrgfe: 0.229240 hartree
zpe.sumelectzpe: -1573.024454 hartree
zpe.sumelectthermal: -1572.997853 hartree
zpe.sumelectthermalent: -1572.996909 hartree
zpe.sumelectthermalfe: -1573.086860 hartree
dipole: -1.4795 8.6371 -0.5355
dipole: 8.7792
quadrupole: -177.9446 -161.9887 -176.0806
quadrupole: 7.8347 8.2850 3.5393
quadrupole: -5.9400 10.0160 -4.0760 7.8347 8.2850 3.5393
hfenergy: -1573.3160999 hartree
pointgroup: C01 [X(C22H13F6N1O1)]
dipole: 0.6499857 -3.3889762 -0.1502651 debye
polarizability: 353.9122485|-5.3943283|355.163474|-22.1816049|-12.4944998|120.1466203 unknown
InChI: InChI=1S/C22H13F6NO/c1-2-10-30-18-12-19(14-6-8-16(9-7-14)21(23,24)25)29-20(13-18)15-4-3-5-17(11-15)22(26,27)28/h1,3-9,11-13H,10H2
charge 0 multiplicity 1
43 atoms
F  4.913161 4.191045 -0.701118
F  2.702821 4.033857 -0.19834
F  4.25913 3.794862 1.42928
F  -6.43419 2.159431 0.961566
F  -5.175934 3.884168 0.180795
F  -6.150295 2.442852 -1.267322
O  0.469682 -4.44702 0.114147
N  0.455593 -0.241404 -0.12284
C  1.619947 -0.969272 -0.150856
C  -0.737347 -0.895515 -0.010482
C  2.884276 -0.183003 -0.275687
C  -1.961038 -0.037873 0.014505
C  1.619273 -2.378989 -0.054052
C  -0.82222 -2.313447 0.061743
C  0.380955 -3.055965 0.043588
C  2.845464 1.219851 -0.073792
C  4.020515 1.988417 -0.191254
C  -3.209603 -0.515975 0.495267
C  -1.879001 1.304697 -0.444058
C  4.126917 -0.789585 -0.59959
C  -4.248879 1.64237 0.03012
C  -4.346808 0.313332 0.502411
C  -3.01045 2.139311 -0.441895
C  5.258434 1.38035 -0.509633
C  5.299864 -0.014156 -0.715533
C  3.970312 3.466874 0.071505
C  -5.469971 2.513283 -0.014095
C  -0.80822 -5.201881 0.216945
C  -0.501821 -6.629955 0.286939
C  -0.2939 -7.841424 0.347913
H  2.537685 -2.969302 -0.040328
H  -1.797223 -2.801871 0.10318
H  1.883944 1.682768 0.162617
H  -3.300835 -1.530414 0.896234
H  -0.911702 1.67167 -0.796503
H  4.186061 -1.866572 -0.786489
H  -5.299968 -0.060572 0.888119
H  -2.933385 3.172183 -0.795031
H  6.16367 1.987183 -0.607419
H  6.24777 -0.496175 -0.974598
H  -1.352342 -4.877525 1.127496
H  -1.434361 -4.984044 -0.672223
H  -0.102782 -8.898266 0.400863
