program: Gaussian 09
title: 000178347
version: EM64L-G09RevD.01
frameworkgroup: C1[X(C20H13F6NS)]
method: RPBEPBE
basis: SDD
operation: Freq
keyword: #p
keyword: freq=noraman
keyword: PBEPBE/SDD
title: #p freq=noraman PBEPBE/SDD
converged: YES YES NO NO
title: Mulliken charges:
elementType: S F F F F F F N C C C C C C C C C C C C C C C C C C C C H H H H H H H H H H H H H
charge: 0.221113 -0.166392 -0.158244 -0.156597 -0.157659 -0.160676 -0.159485 -0.093556 0.413650 0.016212 0.317171 0.322618 -0.480947 -0.484303 -0.481922 0.063347 -0.235536 -0.166019 0.339301 -0.294983 0.227539 0.238635 -0.368031 -0.369609 -0.245189 -0.228992 -0.234944 -0.858288 0.315911 0.254865 0.296011 0.234870 0.245212 0.222187 0.268461 0.228625 0.231469 0.232621 0.271232 0.270376 0.269946
chargesum: 0.00000
title: Mulliken charges with hydrogens summed into heavy atoms:
elementType: S F F F F F F N C C C C C C C C C C C C C C C C C C C C
charge: 0.221113 -0.166392 -0.158244 -0.156597 -0.157659 -0.160676 -0.159485 -0.093556 0.413650 0.016212 0.317171 0.322618 -0.165037 -0.229438 -0.185911 0.063347 -0.000667 -0.166019 0.339301 -0.049771 0.227539 0.238635 -0.145843 -0.101149 -0.016564 0.002477 -0.002323 -0.046734
polarizability: 3.55392613e+02 2.08508665e+01 3.32116595e+02 4.36786832e+00 -1.43032438e+01 1.14716858e+02
1716.lowfreq: -3.1253 -0.0010 0.0007 0.0011 2.0418 2.7396 7.7441 9.5131 14.0485
frequency: 6.3554 9.4685 14.0152 33.3009 42.1199 44.3735 53.0270 82.2255 87.9362 105.2818 115.1230 129.5265 140.7107 172.1150 201.0742 214.3578 226.1587 233.6623 239.3422 252.7026 267.4191 280.9114 292.3983 320.1848 347.6388 370.2733 387.8954 402.5809 410.8786 429.9715 440.6658 457.5257 465.5168 507.1449 526.5666 534.0749 581.1248 595.3235 607.7804 615.6539 619.7135 634.3961 635.2725 666.5443 671.8589 691.4491 697.7967 704.7076 739.5448 783.2980 790.0561 793.4536 852.1885 853.4767 868.7987 883.0171 919.0848 926.2715 935.2752 954.9464 968.5249 969.6811 983.6234 986.9717 990.1930 990.9222 991.4381 996.4090 1004.3164 1016.7163 1021.0466 1031.5816 1039.7820 1081.8244 1090.6877 1097.6253 1117.8623 1132.8252 1173.5730 1192.1935 1224.7078 1236.3363 1289.5726 1294.2452 1307.2514 1317.3074 1346.4924 1351.3466 1365.7112 1386.6975 1402.3287 1404.3413 1440.8653 1451.4865 1455.7761 1459.5978 1463.7797 1489.2515 1536.0908 1561.5441 1588.5557 1612.9059 1614.6606 1616.9944 3010.6783 3127.2845 3130.1728 3135.7822 3138.4866 3148.0942 3160.9372 3162.9922 3168.2079 3173.5951 3174.2824 3176.6826 3180.5780
redmass: 13.9886 11.6801 18.0247 3.7817 6.4427 4.5245 6.5718 7.0052 7.0437 9.4696 5.7728 5.5636 7.3849 3.0582 3.8493 4.0218 2.5602 2.8565 3.5749 7.1174 11.5493 7.5969 5.5763 10.3410 7.4177 9.6038 8.5940 2.9306 7.1311 6.2478 11.2427 8.8530 4.5293 13.7673 6.5311 6.7436 5.5445 4.7317 13.4545 6.6726 11.2900 7.7856 7.5503 6.9899 4.6393 10.3661 1.6806 2.0639 2.8350 1.9539 11.2777 7.4549 1.2839 1.7491 8.5119 1.5371 1.7895 1.4426 1.4547 6.3294 1.1825 1.7233 1.4727 5.8056 4.9497 6.0773 1.3919 5.7151 1.3417 7.8634 3.5325 8.7476 3.3850 1.7036 2.5337 2.3863 2.1559 1.8119 1.0576 1.1343 2.2694 1.8142 1.2354 2.9452 2.0698 3.0491 1.9568 1.4041 5.0409 7.2294 6.5896 4.1112 2.5118 3.6700 1.0521 1.3691 2.1708 2.5751 8.3675 4.8246 6.2193 6.0804 6.7504 6.0247 1.0292 1.0849 1.1065 1.0883 1.1021 1.0936 1.0948 1.0934 1.0919 1.0985 1.0920 1.0936 1.0901
irintensity: 0.0590 0.0565 0.0783 0.0473 0.5864 1.0480 1.7307 2.1572 1.0015 0.4725 0.3453 0.3364 0.0534 2.3951 0.2507 1.0664 1.0279 0.3406 0.6846 1.0361 2.2365 0.2923 0.4403 0.6462 1.1776 10.2419 9.1048 0.0217 0.4803 1.4931 0.2460 0.1743 1.3258 0.8576 4.4829 3.5567 4.1080 10.3948 25.9223 3.7675 29.2981 17.5715 0.7826 3.1083 3.7308 33.4945 57.1590 11.5419 1.8076 63.2516 65.3200 25.3813 2.9304 25.6407 25.6418 8.2834 109.2426 5.6120 3.3202 4.0378 6.4524 43.5669 1.7836 6.6619 25.1233 83.8528 17.2385 250.9085 2.6856 30.1864 94.0187 33.2495 150.3073 32.8416 54.8856 110.8332 42.8892 2.5183 1.3860 11.1073 256.3797 267.6176 2.5629 75.8824 2.0153 7.4521 64.8708 58.6869 92.7254 1.9404 0.2334 18.9531 2.7869 43.3266 18.0760 14.4947 61.5684 8.0220 150.1682 290.2025 0.8214 2.1398 15.9270 5.1915 16.3363 3.0484 14.0248 4.2428 6.0611 25.9434 10.3465 19.3616 2.8230 17.7090 5.9207 3.1638 2.4287
temp: 298.150 k
press: 1.00000 atm
elementType: 16 9 9 9 9 9 9 7 6 6 6 6 6 6 6 6 6 6 6 6 6 6 6 6 6 6 6 6 1 1 1 1 1 1 1 1 1 1 1 1 1
symmnumber: 1
zpe: 734800.0 jmol-1
zpe.correction: 0.279871 hartree
zpe.thermalcorrener: 0.305194 hartree
zpe.thermalcorrenthalpy: 0.306138 hartree
zpe.thermalcorrgfe: 0.218603 hartree
zpe.sumelectzpe: -1819.850908 hartree
zpe.sumelectthermal: -1819.825584 hartree
zpe.sumelectthermalent: -1819.824640 hartree
zpe.sumelectthermalfe: -1819.912175 hartree
dipole: -4.0053 3.6930 -0.4567
dipole: 5.4671
quadrupole: -169.7451 -157.8257 -174.0987
quadrupole: 4.5743 -0.5112 -5.4200
quadrupole: -2.5219 9.3974 -6.8755 4.5743 -0.5112 -5.4200
hfenergy: -1820.1307787 hartree
pointgroup: C01 [X(C20H13F6N1S1)]
dipole: -1.6312273 -1.3776961 0.2597464 debye
polarizability: 353.4238217|-22.2817523|332.449703|-7.8333683|-22.330987|116.3525415 unknown
InChI: InChI=1S/C20H13F6NS/c1-28-16-10-17(12-5-3-2-4-6-12)27-18(11-16)13-7-14(19(21,22)23)9-15(8-13)20(24,25)26/h2-11H,1H3
charge 0 multiplicity 1
41 atoms
S  -2.907116 -4.306128 0.462619
F  4.084097 -3.107959 0.149963
F  4.651706 -2.035093 -1.761106
F  5.587198 -1.40367 0.2025
F  1.79121 3.576222 1.031875
F  4.010075 3.186692 0.741757
F  2.673915 3.541687 -1.052742
N  -1.524207 0.104311 -0.04808
C  0.840074 -0.422102 0.030659
C  -0.583776 -0.878303 0.075154
C  3.249938 -0.848167 -0.161404
C  2.456807 1.422899 0.123471
C  1.125806 0.961858 0.152448
C  1.920643 -1.322056 -0.135958
C  3.536047 0.526682 -0.034063
C  -2.853994 -0.235348 -0.019265
C  -0.925706 -2.244068 0.251265
C  -2.292799 -2.601673 0.265655
C  -3.834507 0.880845 -0.154972
C  -3.266906 -1.585592 0.11835
C  4.372038 -1.824796 -0.380741
C  2.727978 2.900357 0.217713
C  -5.200207 0.728803 0.209946
C  -3.399741 2.138379 -0.655047
C  -6.105731 1.801376 0.070137
C  -4.305445 3.209126 -0.79689
C  -5.663913 3.045678 -0.436754
C  -1.324738 -5.306437 0.609052
H  0.284656 1.648968 0.2790
H  1.745076 -2.394959 -0.251815
H  4.568389 0.887212 -0.040551
H  -0.148714 -2.998206 0.389485
H  -4.328363 -1.846459 0.094397
H  -5.561732 -0.216038 0.630274
H  -2.346742 2.251237 -0.928306
H  -7.152989 1.66968 0.363592
H  -3.954146 4.169982 -1.188744
H  -6.368312 3.877783 -0.545125
H  -1.655875 -6.349255 0.727989
H  -0.75088 -5.001531 1.497691
H  -0.71962 -5.216939 -0.306332
