program: Gaussian 09
title: 000178376
version: EM64L-G09RevD.01
frameworkgroup: C1[X(C23H29NO7)]
method: RPBEPBE
basis: SDD
operation: Freq
keyword: #p
keyword: freq=noraman
keyword: PBEPBE/SDD
title: #p freq=noraman PBEPBE/SDD
converged: NO YES NO NO
title: Mulliken charges:
elementType: O O O O O O O N C C C C C C C C C C C C C C C C C C C C C C C H H H H H H H H H H H H H H H H H H H H H H H H H H H H H
charge: -0.257184 -0.244415 -0.427884 -0.262337 -0.151901 -0.211511 -0.204817 -0.234723 0.215796 -0.033816 -0.058720 -0.538792 0.264180 -0.511048 -0.458141 -0.102509 -0.227659 0.011493 0.139736 -0.446213 0.289260 -0.408748 -0.451072 -0.206866 0.062218 -0.801578 0.059505 0.179007 -0.710443 -0.790258 -0.514151 0.214850 0.283612 0.218325 0.241972 0.251945 0.227138 0.263861 0.254986 0.237117 0.221959 0.222535 0.205321 0.220627 0.247734 0.216057 0.263608 0.247851 0.244617 0.265161 0.337955 0.219672 0.248437 0.218143 0.238662 0.272453 0.225826 0.240368 0.244554 0.238247
chargesum: 0.00000
title: Mulliken charges with hydrogens summed into heavy atoms:
elementType: O O O O O O O N C C C C C C C C C C C C C C C C C C C C C C C
charge: -0.257184 -0.244415 -0.089929 -0.262337 -0.151901 -0.211511 -0.204817 -0.234723 0.215796 0.181034 -0.058720 -0.036856 0.264180 -0.017132 0.032859 0.152477 0.009458 0.011493 0.139736 -0.001719 0.289260 0.017200 0.012719 0.056742 0.062218 -0.043950 0.059505 0.179007 -0.024192 -0.053316 0.209019
polarizability: 3.09868321e+02 7.49469487e+00 2.79161368e+02 2.62004994e+00 -1.23394611e+01 2.31011053e+02
1716.lowfreq: -7.6253 -3.0390 0.0007 0.0008 0.0008 6.0526 12.5079 20.3271 36.6626
frequency: 12.3328 20.2606 36.6348 45.1529 56.6607 64.3953 73.8685 74.2776 86.7579 98.6486 101.2534 112.1192 121.8391 132.8793 148.4875 166.1251 178.4996 190.8432 201.1311 206.6601 210.6033 221.5216 236.6563 248.5690 250.3798 258.6916 277.0018 279.6883 284.4876 293.7000 302.7340 311.7623 321.0814 331.0132 347.7008 368.1829 369.7118 382.4985 395.1117 397.4066 466.4880 480.9851 509.0240 530.0325 535.8413 557.5960 561.7327 583.0780 600.1895 633.8723 641.8580 648.6390 655.5409 675.0645 696.0121 705.8237 715.6858 731.6266 747.4234 758.8526 788.8719 809.4809 833.6381 858.7101 862.9542 865.8239 881.4819 902.5959 913.1063 919.3291 944.0948 946.5782 953.7720 970.9323 984.3160 985.2610 996.5858 1001.9424 1013.2352 1021.2726 1035.9448 1038.3972 1039.5579 1052.0877 1061.7874 1082.6173 1093.4307 1097.2841 1099.0767 1110.5700 1116.2856 1131.0978 1132.3031 1138.3186 1157.9350 1158.3929 1176.1519 1180.4993 1188.1144 1197.8848 1211.7630 1212.8488 1220.1990 1235.4364 1239.1051 1248.8725 1267.7415 1281.9045 1288.5305 1295.9360 1299.2102 1300.0943 1303.0829 1315.8987 1322.6118 1325.3248 1331.6849 1348.0746 1351.4002 1358.2414 1368.5080 1374.9528 1394.0553 1402.1260 1403.5262 1439.5762 1444.7101 1451.8312 1457.1324 1463.2792 1465.0407 1468.7499 1469.8038 1474.5770 1474.7284 1476.7866 1478.1439 1481.2709 1483.9613 1491.2042 1611.8162 1633.7124 1645.6699 1695.8583 1699.5723 2894.3928 2971.2928 2986.2084 2987.7555 2988.3044 2990.3104 2991.6189 2995.7228 2998.3501 3000.7677 3005.0399 3013.6968 3017.2734 3020.2676 3040.3278 3056.9144 3059.6922 3070.6645 3070.8653 3081.8631 3085.8114 3091.1481 3093.8749 3097.9849 3103.6382 3108.8966 3122.3083 3139.3886 3555.0819
redmass: 5.5049 6.3908 4.4774 4.5190 3.5310 3.9429 1.3574 3.2448 3.5674 3.4820 4.8599 3.2109 1.2400 4.4077 3.8112 2.6203 3.8761 1.8062 1.1837 1.7515 4.4336 2.7880 3.3655 2.9806 3.3277 1.9045 3.2497 3.1762 3.4521 2.7019 4.9553 3.4946 3.0803 3.8593 2.6517 3.0138 4.5903 2.6964 4.4469 4.4629 3.9695 3.9070 4.3459 4.9967 7.5451 5.1822 4.2099 4.8993 3.4060 3.8980 5.0469 3.6380 5.3690 5.1774 6.0945 4.0116 2.6197 3.1746 3.9374 4.2388 2.7755 4.1491 3.1742 2.8506 3.1501 2.5856 2.8884 4.8685 2.0241 2.5022 1.9231 3.7913 3.5524 2.8221 3.0440 2.5607 2.8306 2.2651 2.2096 2.7583 2.3332 1.7441 1.4268 2.7482 2.6004 3.0805 2.5487 2.6127 2.2089 1.2660 2.4215 1.7756 2.0795 1.9016 2.3481 1.9534 1.7513 1.6733 2.4895 2.3056 1.5095 3.5545 1.8104 1.4037 2.5000 1.2842 1.3371 1.4420 1.4196 1.8322 1.3860 1.5853 2.4154 1.3897 1.8250 1.6323 1.8093 1.4947 1.2787 1.4370 1.3653 1.3632 1.1993 1.2496 1.2649 1.2073 1.0590 1.0838 1.0686 1.0892 1.0534 1.0751 1.0788 1.0665 1.0580 1.0907 1.0512 1.0544 1.0866 1.0498 8.2533 10.9415 10.2038 11.7282 12.3180 1.0819 1.0818 1.0371 1.0602 1.0399 1.0364 1.0707 1.0660 1.0653 1.0325 1.0728 1.0848 1.0607 1.0661 1.0965 1.1007 1.0957 1.1013 1.0970 1.1019 1.1003 1.0994 1.0992 1.1001 1.1004 1.1050 1.0987 1.1037 1.0661
irintensity: 0.7002 2.7576 4.9007 1.0562 2.2441 1.2186 1.4100 1.7581 1.1980 3.4046 0.8400 0.7897 0.4160 1.3044 1.0285 4.2602 2.1070 0.2415 1.1102 1.7806 3.0505 6.3574 1.2541 5.2134 5.3677 27.7746 16.9336 5.1403 21.0853 27.8927 13.0040 17.9507 0.4406 3.8859 0.3687 0.8966 0.5956 1.9479 0.9349 9.7147 18.8072 5.0796 6.1324 4.6045 0.7449 6.1709 4.8586 0.0755 0.7602 10.2754 15.2887 10.4599 4.0175 4.8450 15.9938 3.4172 1.0975 12.4130 1.9888 8.0666 23.3317 7.1804 25.4473 3.5186 47.5962 26.1042 7.6965 37.4013 47.0502 23.7479 13.6851 45.7064 48.4010 10.0506 53.3847 55.2004 65.4989 8.4302 100.8681 9.7217 33.6652 21.5343 2.0693 44.5402 41.3311 35.0245 29.9121 142.2706 17.2406 0.9133 42.0241 6.8372 3.0389 15.7804 41.0905 22.3475 55.0791 23.9394 8.7171 22.4072 30.2762 17.1197 25.0924 0.7920 25.5010 4.9213 0.5511 1.9464 11.2624 37.5235 6.1092 15.9751 77.1964 4.9960 37.2492 11.4348 3.3276 11.9187 17.7216 8.7339 5.4789 0.4346 15.9687 18.6316 26.2744 13.5491 11.8963 2.0102 30.6263 4.5164 10.7815 12.6460 12.1867 14.8875 9.8834 30.6835 8.0821 1.6392 12.9359 23.5851 111.0580 149.5904 433.0612 230.2048 300.8319 57.8925 4.1657 16.2705 21.0482 18.5741 24.6674 13.8673 19.3308 15.5216 63.1785 13.1635 29.8065 23.1573 32.5105 30.3854 44.5190 9.8300 16.3426 8.9282 21.4731 11.4836 34.4665 6.6611 14.1057 10.3707 27.3902 5.5788 12.3917 4.6813
temp: 298.150 k
press: 1.00000 atm
elementType: 8 8 8 8 8 8 8 7 6 6 6 6 6 6 6 6 6 6 6 6 6 6 6 6 6 6 6 6 6 6 6 1 1 1 1 1 1 1 1 1 1 1 1 1 1 1 1 1 1 1 1 1 1 1 1 1 1 1 1 1
symmnumber: 1
zpe: 1274276.7 jmol-1
zpe.correction: 0.485346 hartree
zpe.thermalcorrener: 0.516109 hartree
zpe.thermalcorrenthalpy: 0.517054 hartree
zpe.thermalcorrgfe: 0.423109 hartree
zpe.sumelectzpe: -1472.799253 hartree
zpe.sumelectthermal: -1472.768490 hartree
zpe.sumelectthermalent: -1472.767546 hartree
zpe.sumelectthermalfe: -1472.861490 hartree
dipole: 1.8646 -3.1716 1.2555
dipole: 3.8875
quadrupole: -199.3016 -199.1258 -175.1364
quadrupole: 12.9599 -25.2470 26.4417
quadrupole: -8.1137 -7.9378 16.0515 12.9599 -25.2470 26.4417
hfenergy: -1473.2845992 hartree
pointgroup: C01 [X(C23H29N1O7)]
dipole: 0.8567788 1.1183696 -0.5953151 debye
polarizability: 306.7235887|-12.1871046|280.4590891|-8.0518628|-13.4144055|232.858064 unknown
InChI: InChI=1S/C23H29NO7/c1-11-10-16(30-20(11)27)14-7-8-22-17(15(25)6-5-9-24(14)22)12(2)18(26)23(22)19(29-4)13(3)21(28)31-23/h11,14-16,25H,5-10H2,1-4H3
charge 0 multiplicity 1
60 atoms
O  -1.381984 -1.685178 1.64671
O  3.004607 0.137621 -1.060402
O  -2.547211 3.651104 -0.98547
O  -1.865323 -0.735097 -1.817511
O  -4.209765 -1.079082 1.038174
O  -0.543774 -3.867917 1.651484
O  5.011712 0.091999 -2.226506
N  0.254343 0.77283 -0.009538
C  -0.979292 0.679928 0.795176
C  1.481738 0.705174 0.815879
C  -1.766202 -0.70608 0.622946
C  -0.477508 0.823426 2.273322
C  -2.080544 1.706658 0.480935
C  0.972415 0.296622 2.227989
C  0.261885 1.568211 -1.254526
C  2.503524 -0.31544 0.290031
C  -1.820829 3.193211 0.229535
C  -3.264836 -0.295684 0.770599
C  -3.346616 1.162975 0.53827
C  0.450035 3.09726 -1.040297
C  -1.531305 -1.441269 -0.686912
C  -0.342221 3.636243 0.172953
C  3.790845 -0.461017 1.137817
C  4.879077 -0.836462 0.103515
C  -1.076847 -2.720312 -0.468775
C  -4.680518 1.847374 0.441382
C  -0.955115 -2.892703 0.994945
C  4.379144 -0.169779 -1.191153
C  6.321279 -0.426964 0.451206
C  -0.731369 -3.881602 -1.370525
C  -1.628602 -1.343867 -3.142314
H  1.997413 1.693851 0.861686
H  -1.109264 0.258532 2.975033
H  -0.498891 1.888373 2.566885
H  1.601479 0.718306 3.029619
H  0.966889 -0.802709 2.336336
H  -0.697612 1.36677 -1.766014
H  1.062131 1.189846 -1.912746
H  1.996212 -1.285859 0.12778
H  -2.324805 3.768828 1.030578
H  0.145886 3.627375 -1.964241
H  1.521535 3.330983 -0.894967
H  0.156288 3.328015 1.111888
H  -0.329254 4.741755 0.155474
H  3.672412 -1.213477 1.933704
H  4.044569 0.508513 1.609832
H  4.84803 -1.93075 -0.083015
H  -5.311025 1.557702 1.302163
H  -5.22249 1.512375 -0.463006
H  -4.584087 2.941797 0.390971
H  -2.311158 3.047527 -1.73576
H  6.688548 -0.989559 1.32732
H  6.992669 -0.625519 -0.401816
H  6.378308 0.652023 0.682668
H  -1.634097 -4.354967 -1.799091
H  -0.222543 -4.649652 -0.762772
H  -0.060616 -3.602434 -2.200304
H  -2.056066 -0.631639 -3.862488
H  -2.142172 -2.315953 -3.222726
H  -0.545734 -1.460437 -3.319629
