program: Gaussian 09
title: 000178291
version: EM64L-G09RevD.01
frameworkgroup: C1[X(C19H26N4O)]
method: RPBEPBE
basis: SDD
operation: Freq
keyword: #p
keyword: freq=noraman
keyword: PBEPBE/SDD
title: #p freq=noraman PBEPBE/SDD
converged: YES YES NO NO
title: Mulliken charges:
elementType: O N N N N C C C C C C C C C C C C C C C C C C C H H H H H H H H H H H H H H H H H H H H H H H H H H
charge: -0.310547 -0.254234 -0.150419 -0.724487 -0.723481 -0.239720 0.574759 0.449877 -0.592059 0.641975 -0.476602 -0.414298 -0.383803 -0.359091 -0.690333 -0.695736 0.223654 -0.661857 -0.702456 0.587618 0.596856 -0.665252 -0.614071 -0.632405 0.207109 0.204234 0.256510 0.228954 0.226884 0.227903 0.247228 0.210881 0.208775 0.229905 0.224807 0.211181 0.210972 0.277278 0.204528 0.201215 0.274505 0.214935 0.222905 0.219446 0.243398 0.259863 0.301339 0.297129 0.308898 0.295329
chargesum: 0.00000
title: Mulliken charges with hydrogens summed into heavy atoms:
elementType: O N N N N C C C C C C C C C C C C C C C C C C C
charge: -0.310547 -0.254234 -0.150419 -0.126018 -0.119254 -0.032611 0.574759 0.449877 -0.131315 0.641975 -0.247648 -0.187414 -0.155900 -0.111863 -0.040772 -0.048776 0.223654 -0.384579 -0.497928 0.587618 0.596856 -0.464037 0.098274 0.090302
polarizability: 2.47431101e+02 -1.16248538e+01 2.72802179e+02 -1.34515942e+01 1.80994393e+01 2.06816717e+02
1716.lowfreq: -4.6773 -1.9002 0.0000 0.0002 0.0005 5.2562 12.3996 21.4415 32.2828
frequency: 12.0993 21.3367 32.0967 40.7225 52.1695 71.2798 74.5572 94.1607 123.1179 130.3462 132.1570 159.6809 177.2720 201.6915 203.5937 210.2775 219.8930 223.4731 242.0750 244.7557 263.2142 263.3505 300.9251 302.7575 324.8291 337.2559 346.7836 353.5253 382.5295 388.8540 396.2571 407.4504 424.1720 428.9663 475.4007 485.0047 514.6259 517.0192 529.6449 558.8188 575.3731 605.1145 623.2269 635.6649 646.7500 681.3470 713.5697 721.1037 746.7226 753.3879 813.7673 830.4410 839.5753 841.3665 847.9101 886.0884 889.0007 914.4538 934.6851 947.6985 952.7730 960.6733 963.1417 978.6035 986.9194 1005.5432 1024.3995 1048.4665 1053.7041 1059.7551 1070.2592 1073.4338 1098.9500 1113.2264 1116.1255 1140.2911 1156.2300 1174.7723 1188.9137 1191.1628 1219.6647 1221.8347 1231.1096 1245.1869 1293.3061 1296.4330 1308.9308 1319.3172 1327.2254 1363.7298 1375.6052 1377.6232 1382.1300 1395.2505 1398.0533 1404.2688 1416.3392 1419.4747 1443.6738 1463.5161 1464.8479 1466.3907 1468.1526 1470.7057 1478.0793 1483.8157 1487.1604 1489.6345 1496.7236 1500.5086 1505.6381 1567.7771 1580.5669 1611.5568 1620.9954 1632.2636 1637.8581 1640.0639 2956.1670 2963.7556 2972.8129 2975.5052 2977.0083 3009.7174 3028.3701 3033.8027 3065.4167 3072.4407 3075.7303 3079.2432 3080.9443 3103.9373 3112.2077 3112.8771 3113.3900 3119.7139 3121.1031 3131.5824 3146.4616 3152.4728 3570.0060 3572.7492 3712.7860 3714.9233
redmass: 4.4444 4.4027 3.0671 3.8378 3.9324 3.7433 3.6923 4.3942 2.4996 1.4497 3.7529 3.6528 1.2045 1.8754 2.1542 1.7187 3.2794 3.2241 2.1784 1.5932 2.7934 3.0747 1.9408 1.6559 1.2289 3.1061 1.0450 2.5727 1.0878 2.7756 3.3467 2.8652 3.5128 4.7672 2.3271 3.1760 5.9623 4.3051 3.8175 3.1973 3.7005 4.2846 3.9457 6.7506 4.4239 2.1260 3.5316 3.4891 3.7936 3.8718 1.5978 1.2913 2.8737 1.7441 1.8380 2.0986 2.5612 1.1921 2.7988 1.3889 1.4509 2.3261 1.5096 4.6858 3.2184 2.8524 2.3889 1.7822 1.5846 1.3830 1.5729 1.9593 1.2253 2.5384 1.5236 1.3886 1.7016 1.4879 1.9312 1.1492 1.7554 1.8567 2.5378 5.6133 1.5786 1.4795 1.3220 1.6870 1.7203 1.4135 1.1974 2.5182 3.6336 1.2272 5.4428 6.1703 1.1859 2.7431 1.2366 1.1055 1.0450 1.0665 1.0517 1.0518 1.0484 1.1173 1.0634 3.2310 1.7456 2.0956 2.3147 5.1272 6.6750 5.6145 6.3655 1.8886 1.9868 1.1989 1.0372 1.0378 1.0348 1.0402 1.0788 1.0634 1.1008 1.1010 1.0999 1.0992 1.1005 1.0990 1.0997 1.0907 1.0909 1.0964 1.0884 1.0875 1.0960 1.0927 1.0943 1.0956 1.0445 1.0445 1.1041 1.1040
irintensity: 0.2592 0.5317 0.0422 2.1070 1.7737 0.8746 0.6355 6.4011 0.7194 0.1962 1.6565 3.2096 0.2341 1.9794 7.5926 8.9100 3.0794 0.0445 0.7085 1.0775 5.5571 2.2341 55.5255 89.8746 394.9798 2.5359 4.0400 3.0604 25.0928 4.3125 15.0096 2.1219 0.7754 3.7722 0.3498 1.4538 0.3464 4.8720 4.0789 6.5889 4.6408 36.7262 0.6080 2.6993 4.8843 2.2676 39.5938 30.5587 5.0814 5.5733 1.4923 1.7424 22.9637 44.7993 15.0768 78.9648 1.6520 2.7464 15.5273 0.9553 0.0432 4.1318 1.2364 1.3451 15.2736 12.8604 3.6977 34.8965 18.8261 4.1120 4.3016 22.7607 0.7987 1.4506 15.6252 0.1239 0.6199 7.5626 285.7152 29.0984 57.4881 1.5382 75.3647 19.8690 6.2396 20.0635 0.9162 5.6513 7.2947 52.2569 15.5049 175.7491 87.0934 11.0785 34.8763 28.9353 55.4855 10.6673 61.7292 44.6902 2.7705 12.6310 3.1956 5.9524 18.5632 4.1779 34.0855 58.7051 19.2148 40.1657 152.7964 286.5361 84.4250 94.4718 11.2867 19.2998 523.3419 107.3874 53.2380 113.8489 33.4297 38.8919 20.4033 36.3368 59.3956 27.4378 0.9337 112.6441 25.4040 2.9565 38.9308 35.1549 20.2887 12.2477 11.6854 23.0858 2.8665 9.0284 22.6682 2.4058 56.2826 42.1957 16.6753 15.8091
temp: 298.150 k
press: 1.00000 atm
elementType: 8 7 7 7 7 6 6 6 6 6 6 6 6 6 6 6 6 6 6 6 6 6 6 6 1 1 1 1 1 1 1 1 1 1 1 1 1 1 1 1 1 1 1 1 1 1 1 1 1 1
symmnumber: 1
zpe: 1100284.9 jmol-1
zpe.correction: 0.419076 hartree
zpe.thermalcorrener: 0.444699 hartree
zpe.thermalcorrenthalpy: 0.445643 hartree
zpe.thermalcorrgfe: 0.362368 hartree
zpe.sumelectzpe: -1032.085181 hartree
zpe.sumelectthermal: -1032.059558 hartree
zpe.sumelectthermalent: -1032.058614 hartree
zpe.sumelectthermalfe: -1032.141889 hartree
dipole: 2.3869 -2.4071 0.3227
dipole: 3.4052
quadrupole: -137.4439 -128.8254 -129.3044
quadrupole: 15.7434 -8.2910 4.9212
quadrupole: -5.5860 3.0325 2.5535 15.7434 -8.2910 4.9212
hfenergy: -1032.5042575 hartree
pointgroup: C01 [X(C19H26N4O1)]
dipole: 0.7180355 -1.1309347 -0.0161979 debye
polarizability: 241.524342|-2.219416|273.5824453|-12.7703811|25.1632125|211.9432106 unknown
InChI: InChI=1S/C19H26N4O/c1-13(2)15-5-7-18(8-6-15)23(19(24)22(3)4)12-14-9-16(20)11-17(21)10-14/h5-11,13H,12,20-21H2,1-4H3
charge 0 multiplicity 1
50 atoms
O  -0.622444 3.465368 0.510273
N  0.093517 1.577617 -0.702873
N  1.664333 3.193035 0.125764
N  -3.866274 -2.842637 -0.866782
N  -3.90487 0.353004 2.834882
C  3.421938 -3.205846 -0.284254
C  2.562223 -1.943829 -0.3921
C  0.930143 0.413225 -0.598657
C  -1.285639 1.411416 -1.267297
C  -2.186667 0.470707 -0.472653
C  1.867731 -1.631418 -1.586487
C  2.415803 -1.05001 0.701162
C  1.068347 -0.473381 -1.69626
C  1.609958 0.101425 0.609197
C  2.865457 -4.185124 0.78441
C  4.90919 -2.866608 0.002986
C  0.334481 2.777032 0.018653
C  -2.615661 0.848153 0.819031
C  -2.600639 -0.753485 -1.042039
C  -3.455705 -1.625507 -0.308023
C  -3.471084 -0.016281 1.55676
C  -3.887076 -1.25139 0.99017
C  1.979688 4.277406 1.068255
C  2.75203 2.778515 -0.772798
H  3.379555 -3.722009 -1.26505
H  -1.194882 1.058263 -2.310968
H  -1.722291 2.423932 -1.284167
H  1.957501 -2.302879 -2.450034
H  2.923225 -1.263854 1.650027
H  0.557378 -0.257384 -2.640622
H  1.489879 0.757868 1.47744
H  2.8930 -3.729501 1.79185
H  3.468416 -5.112044 0.815876
H  1.81693 -4.457257 0.567766
H  5.325842 -2.204454 -0.777425
H  5.519944 -3.7881 0.040349
H  5.016823 -2.351501 0.975887
H  -2.289559 1.810197 1.23147
H  -2.258001 -1.040136 -2.044554
H  -4.547677 -1.91949 1.559515
H  1.095097 4.47389 1.691764
H  2.836882 3.99188 1.708659
H  2.23838 5.211546 0.530322
H  3.324333 3.675024 -1.080245
H  3.447308 2.064301 -0.289617
H  2.342825 2.299371 -1.674572
H  -3.549326 -3.119757 -1.790146
H  -4.470068 -3.475442 -0.351864
H  -3.619653 1.241467 3.2348
H  -4.534843 -0.239221 3.366515
