program: Gaussian 09
title: 000178354
version: EM64L-G09RevD.01
frameworkgroup: C1[X(C22H15F6NO)]
method: RPBEPBE
basis: SDD
operation: Freq
keyword: #p
keyword: freq=noraman
keyword: PBEPBE/SDD
title: #p freq=noraman PBEPBE/SDD
converged: YES YES NO NO
title: Mulliken charges:
elementType: F F F F F F O N C C C C C C C C C C C C C C C C C C C C C C H H H H H H H H H H H H H H H
charge: -0.166633 -0.165230 -0.164050 -0.163219 -0.166964 -0.166412 -0.254062 -0.097824 0.064014 0.049134 0.372552 0.367664 -0.427238 0.383430 -0.448891 -0.485809 0.294334 -0.360682 -0.361917 -0.369607 0.288143 -0.345466 -0.360708 -0.343314 -0.229049 0.240631 0.249946 -0.348277 -0.065073 -0.542774 0.253584 0.251366 0.305465 0.283947 0.227868 0.233259 0.265189 0.261881 0.265745 0.238280 0.225086 0.219433 0.240797 0.229077 0.222373
chargesum: 0.00000
title: Mulliken charges with hydrogens summed into heavy atoms:
elementType: F F F F F F O N C C C C C C C C C C C C C C C C C C C C C C
charge: -0.166633 -0.165230 -0.164050 -0.163219 -0.166964 -0.166412 -0.254062 -0.097824 0.064014 0.049134 0.372552 0.367664 -0.173653 0.383430 -0.197525 -0.180344 0.294334 -0.076735 -0.134049 -0.136348 0.288143 -0.080277 -0.098827 -0.077568 0.009231 0.240631 0.249946 0.096242 0.175723 -0.091324
polarizability: 3.60647261e+02 -2.66486716e+00 3.46921589e+02 -1.11017690e+01 -3.04233274e-01 1.28505785e+02
1716.lowfreq: -1.7825 0.0000 0.0004 0.0011 3.0959 4.1479 9.2057 12.6245 14.4116
frequency: 8.9928 12.5168 14.4010 27.2408 35.1330 36.0976 45.0555 57.0261 78.4843 82.5340 113.6379 119.9260 124.8553 139.1451 156.2369 191.8867 200.8292 219.4581 225.2202 233.6252 249.4912 275.9171 303.0635 316.9591 337.2596 355.0043 359.6172 368.6233 403.4501 408.8997 421.1306 427.0327 450.0729 457.2143 469.6178 511.6942 520.4601 538.6041 557.4224 573.5898 596.7199 608.7986 618.2190 624.0353 631.0460 636.5148 660.6888 669.3951 701.2316 708.6735 734.8182 740.7343 753.6475 814.7111 841.7210 847.0520 847.6317 870.1665 874.6184 877.4007 928.6026 930.9467 954.6024 957.1085 963.9116 967.6067 974.6315 980.6201 983.8861 988.3712 989.5444 991.4731 992.3077 999.8751 1010.8422 1017.3929 1022.4812 1029.6209 1041.2309 1064.3062 1107.7431 1120.6170 1133.3873 1150.3300 1175.4873 1191.4457 1198.8634 1223.4058 1228.3658 1280.0228 1282.9407 1284.8407 1299.9320 1306.9620 1319.9642 1337.0035 1352.4841 1370.2621 1381.6826 1401.1312 1406.6279 1418.6419 1434.7537 1455.7224 1470.0878 1483.9064 1510.7056 1548.6302 1577.5029 1586.1307 1597.9111 1618.7511 1624.7495 1667.4499 2951.8341 3028.2654 3095.7143 3127.5799 3141.8242 3144.5980 3157.3500 3159.6621 3169.1424 3173.6575 3178.1916 3181.2048 3181.3720 3182.8154 3206.8296
redmass: 18.7066 16.4630 7.1278 7.6806 6.0622 4.3022 5.0315 5.5869 4.9734 2.8836 4.5863 4.4787 7.7910 4.3165 7.8365 6.9385 5.0298 7.3195 5.2108 6.1835 6.5146 4.0594 6.7137 7.0793 7.3670 6.2586 8.1925 6.9300 2.9773 4.7251 6.0047 4.8439 4.9924 5.0185 4.6165 8.0529 8.9797 4.3393 4.5087 5.4671 4.7791 10.7861 8.7490 3.8002 4.1485 4.5112 3.2609 4.3838 1.8996 8.7800 3.7578 6.2960 3.2833 1.6158 1.4588 2.1420 2.9294 2.4207 2.2397 1.7499 1.4304 1.6300 2.8382 2.5551 1.5388 1.6073 2.9792 5.0940 1.7545 5.8707 3.6011 1.6137 3.3552 1.7806 1.2916 6.0573 7.2637 3.0563 3.6513 2.1653 1.7524 2.0334 1.4971 1.6815 2.0405 1.1066 1.1334 1.2566 1.8534 2.3304 4.0367 1.2872 1.5837 1.3965 3.8028 1.9929 3.3898 2.6135 5.6675 7.0043 4.0248 3.3434 1.2225 3.0934 1.1882 2.7507 2.8724 8.7968 5.5139 6.9215 6.1124 6.6003 6.3191 4.7531 1.0580 1.1039 1.0613 1.0948 1.0869 1.0881 1.0924 1.0894 1.0961 1.0980 1.0927 1.0927 1.0951 1.0917 1.1144
irintensity: 0.0481 0.1417 0.2246 0.0971 0.2808 0.0689 0.7257 0.2967 1.3384 1.3461 1.0284 0.9452 0.7720 0.3873 0.3648 1.2896 1.3493 0.1449 1.0723 4.5476 3.7806 3.1063 1.1323 1.5731 3.3196 1.9055 2.8736 5.1565 1.5816 9.9231 13.4512 0.4648 1.9338 2.6340 1.3189 2.2699 0.4116 1.6951 7.6547 0.3483 15.4619 18.2027 0.7482 10.3881 12.1837 9.6370 3.7274 0.8735 32.3235 3.4923 10.0871 19.6018 4.9962 57.2405 65.4136 30.6150 41.6021 16.2729 55.7609 21.9196 5.1591 7.1197 42.7959 51.9406 102.5331 46.1132 53.4327 195.0255 25.0369 67.0500 74.8744 24.6298 107.2112 32.1537 11.4009 162.8042 162.4788 91.0635 178.0060 1.3513 24.2128 12.8295 0.8841 7.3194 336.0096 27.1631 0.4249 5.6704 21.1255 89.3621 502.7053 15.5301 39.9496 5.6547 31.8656 149.6016 2.3043 32.7308 9.6592 25.7019 42.7127 10.9686 38.6668 49.9984 4.2662 10.6205 5.9811 181.0995 223.8992 146.0075 3.4965 9.5160 37.1246 3.3291 25.0990 24.2025 7.7598 7.3755 7.0506 7.5703 6.5001 0.6581 3.8328 6.4045 5.5721 3.1419 3.8685 6.6193 22.3076
temp: 298.150 k
press: 1.00000 atm
elementType: 9 9 9 9 9 9 8 7 6 6 6 6 6 6 6 6 6 6 6 6 6 6 6 6 6 6 6 6 6 6 1 1 1 1 1 1 1 1 1 1 1 1 1 1 1
symmnumber: 1
zpe: 828432.5 jmol-1
zpe.correction: 0.315533 hartree
zpe.thermalcorrener: 0.342374 hartree
zpe.thermalcorrenthalpy: 0.343319 hartree
zpe.thermalcorrgfe: 0.252133 hartree
zpe.sumelectzpe: -1574.251250 hartree
zpe.sumelectthermal: -1574.224408 hartree
zpe.sumelectthermalent: -1574.223464 hartree
zpe.sumelectthermalfe: -1574.314649 hartree
dipole: 0.8707 9.3872 -0.3098
dipole: 9.4326
quadrupole: -179.5423 -164.0887 -175.8609
quadrupole: -9.2677 -6.9051 3.6115
quadrupole: -6.3783 9.0752 -2.6970 -9.2677 -6.9051 3.6115
hfenergy: -1574.5667829 hartree
pointgroup: C01 [X(C22H15F6N1O1)]
dipole: -0.6925753 3.6445106 0.0999801 debye
polarizability: 360.5471809|3.9250162|347.5392198|1.6873525|0.4394597|127.9882341 unknown
InChI: InChI=1S/C22H15F6NO/c1-2-10-30-18-12-19(14-6-8-16(9-7-14)21(23,24)25)29-20(13-18)15-4-3-5-17(11-15)22(26,27)28/h2-9,11-13H,1,10H2
charge 0 multiplicity 1
45 atoms
F  -4.92359 -4.267223 0.245309
F  -4.193594 -3.839786 -1.853765
F  -2.697775 -4.078591 -0.169849
F  5.172503 -3.873262 0.192933
F  6.449637 -2.162054 -0.587327
F  6.0704 -2.376019 1.634518
O  -0.519829 4.413786 -0.164112
N  -0.49863 0.206481 0.033564
C  -1.666823 0.926586 -0.022741
C  0.694064 0.871576 0.021123
C  -2.930913 0.12977 -0.005571
C  1.92319 0.023661 0.08361
C  -1.669882 2.336969 -0.107012
C  -0.433381 3.026057 -0.101403
C  0.772631 2.290011 -0.0303
C  -2.865375 -1.270051 -0.222201
C  -4.03948 -2.048495 -0.206395
C  1.819692 -1.321917 0.528392
C  3.199456 0.515259 -0.301816
C  -4.199917 0.72261 0.228529
C  4.221019 -1.636655 0.228383
C  2.956013 -2.146587 0.606068
C  4.34143 -0.303995 -0.229374
C  -5.303628 -1.453795 0.022457
C  -5.372212 -0.062669 0.242445
C  -3.959821 -3.523095 -0.482346
C  5.445264 -2.494336 0.355898
C  0.749127 5.191743 -0.193552
C  0.379885 6.638732 -0.36906
C  0.823405 7.631567 0.439284
H  -2.58993 2.919502 -0.187824
H  1.741384 2.790369 0.015551
H  -1.884844 -1.722835 -0.39013
H  0.832249 -1.699219 0.806196
H  3.309317 1.532664 -0.690323
H  -4.282018 1.796496 0.424559
H  2.8631 -3.181813 0.94813
H  5.316827 0.080083 -0.542951
H  -6.208917 -2.068219 0.04165
H  -6.341286 0.409122 0.433253
H  1.310214 5.028261 0.747219
H  1.358124 4.830513 -1.049469
H  -0.267308 6.862105 -1.227238
H  0.562896 8.678623 0.252625
H  1.460226 7.429273 1.309463
