program: Gaussian 09
title: 000178311
version: EM64L-G09RevD.01
frameworkgroup: C1[X(C18H36O3Si)]
method: RPBEPBE
basis: SDD
operation: Freq
keyword: #p
keyword: freq=noraman
keyword: PBEPBE/SDD
title: #p freq=noraman PBEPBE/SDD
converged: YES YES NO NO
title: Mulliken charges:
elementType: Si O O O C C C C C C C C C C C C C C C C C C H H H H H H H H H H H H H H H H H H H H H H H H H H H H H H H H H H H H
charge: 1.437937 -0.640981 -0.458235 -0.443383 0.426336 -0.124694 -0.050101 0.292916 -0.509755 -0.534964 -0.465076 -0.475577 -0.461970 -0.079490 -0.856411 -0.789797 -0.153090 -1.071738 -1.052432 -0.708439 -0.696224 -0.704628 0.180740 0.175229 0.216506 0.216391 0.220371 0.191556 0.247389 0.190852 0.190430 0.227509 0.228291 0.175061 0.238282 0.249931 0.202959 0.257081 0.235346 0.221446 0.210352 0.324289 0.315857 0.238481 0.244317 0.242292 0.249134 0.233108 0.235786 0.207395 0.207361 0.248089 0.208904 0.242966 0.204575 0.216038 0.210161 0.215322
chargesum: 0.00000
title: Mulliken charges with hydrogens summed into heavy atoms:
elementType: Si O O O C C C C C C C C C C C C C C C C C C
charge: 1.437937 -0.640981 -0.133946 -0.127526 0.426336 0.056046 0.125129 0.292916 -0.076859 -0.123037 -0.026835 -0.057639 -0.058619 0.158791 -0.146440 -0.122653 -0.153090 -0.346648 -0.334404 -0.045595 -0.039779 -0.063106
polarizability: 2.56744681e+02 -6.21127803e-01 2.20505938e+02 4.30005546e+00 1.48787348e+00 1.93569877e+02
1716.lowfreq: -14.8419 -7.8301 0.0005 0.0009 0.0011 7.9835 12.3070 27.6983 38.5135
frequency: 8.6249 27.5270 38.1307 48.3520 75.4553 84.9873 102.6268 111.0180 113.0603 115.1879 142.5498 147.4142 165.0313 184.3892 196.1033 201.3853 205.0570 208.2821 212.0419 223.9318 247.3847 249.3544 265.2404 271.4574 274.7429 284.8509 291.8023 297.5310 298.4018 309.1255 312.2704 321.3378 353.8047 364.6762 375.7927 386.4603 393.9101 413.3011 441.0208 454.6183 475.3116 499.5272 505.6750 538.5772 554.7954 570.7328 595.6437 651.4681 691.6389 700.0803 741.6399 760.4074 785.1811 799.0540 810.1225 817.3986 822.5736 857.3019 873.3344 884.3114 897.6328 899.8492 907.3524 930.9483 939.6655 943.2255 945.3472 949.1430 961.7037 994.3737 1001.4252 1006.5231 1014.4612 1018.5941 1030.2545 1032.9037 1054.7974 1069.2929 1078.8260 1105.9213 1117.9247 1120.7293 1135.5200 1148.8320 1169.0717 1185.0367 1189.4002 1197.1439 1200.8440 1207.9697 1217.2846 1235.6766 1250.3565 1277.0045 1290.0482 1290.9696 1299.2521 1301.6996 1311.2835 1318.5320 1320.4660 1326.6160 1341.7049 1344.6273 1347.5869 1351.7314 1360.5271 1372.0988 1375.4187 1377.6826 1384.3418 1386.1528 1400.5959 1438.7676 1441.8474 1448.1866 1448.9404 1452.0872 1455.8474 1461.7499 1462.9993 1465.0445 1468.0547 1468.4017 1471.6585 1475.6723 1477.5193 1480.4594 1483.2017 1485.3559 1495.8587 1499.9740 2876.7659 2934.2031 2951.9053 2955.3309 2956.6911 2958.5380 2970.0640 2974.1584 2979.3515 2979.6317 2983.2549 2985.1287 2988.0193 3001.6689 3022.4558 3035.1512 3038.6591 3041.3920 3045.6543 3046.8686 3047.6986 3056.5080 3059.9945 3066.2810 3072.3992 3073.2670 3076.5907 3077.0759 3078.2093 3082.4988 3082.7350 3086.0144 3092.9631 3099.8234 3536.1208 3549.3643
redmass: 3.5448 3.6263 2.7760 2.8935 3.2962 1.5998 2.2153 2.5935 2.1579 1.2201 3.2451 2.6374 2.2124 2.7355 1.9019 2.1970 1.2661 1.6301 1.4910 1.4311 2.0898 1.3845 1.9365 2.2647 1.1217 1.3544 1.8615 2.3349 2.2040 3.1944 2.2454 2.6733 2.8447 3.0931 2.8061 2.4745 2.5856 2.6761 3.4061 2.2149 3.6673 3.1190 2.9669 3.0352 3.0405 2.8084 2.5410 3.8983 2.6245 2.8373 4.1842 3.7186 1.2504 1.8046 1.7268 2.5863 2.2889 1.9808 2.0749 1.7376 1.5296 1.8618 1.9291 2.0672 1.6817 1.6513 2.0711 1.2354 2.0714 2.0749 1.9182 1.4600 1.4028 2.3975 1.9988 3.4538 1.9311 2.1640 2.5237 1.7456 1.6854 1.8215 1.7524 2.1695 1.9638 1.9197 1.6305 2.7963 2.7652 2.2715 1.6186 1.6140 1.4504 1.3742 1.4888 1.2168 1.2056 1.4247 1.3518 1.3067 1.3963 1.3624 1.4187 1.4598 1.4566 1.3001 1.5998 1.1843 1.2031 1.2299 1.1990 1.1938 1.1942 1.0531 1.0554 1.0583 1.0746 1.0547 1.0795 1.0535 1.0689 1.0581 1.0630 1.0610 1.0530 1.0643 1.0615 1.0817 1.0538 1.0495 1.0535 1.0582 1.0823 1.0809 1.0355 1.0364 1.0673 1.0366 1.0567 1.0422 1.0453 1.0482 1.0347 1.0556 1.0423 1.0642 1.0964 1.0954 1.0985 1.0981 1.0954 1.0962 1.0982 1.0992 1.0954 1.0986 1.0986 1.0984 1.0983 1.0977 1.0973 1.0991 1.0974 1.0984 1.0981 1.0996 1.0658 1.0655
irintensity: 0.0165 0.5278 0.1220 0.1716 1.3324 0.3770 0.4215 0.2328 0.2797 0.0166 0.4057 0.2484 1.2066 3.9572 1.3843 2.0316 0.0218 6.6152 1.3267 2.3416 25.7898 2.1490 4.1849 11.6192 3.4785 78.6418 5.8530 17.5206 25.3785 8.7477 87.9439 5.2138 23.7572 12.9080 2.4397 3.0721 2.7932 2.3279 9.6415 3.6635 13.7988 1.7141 1.5171 1.5612 6.0639 6.8145 8.8511 14.1961 14.8780 4.0456 28.3203 8.4847 0.7165 6.6733 54.6689 12.7676 12.8044 29.7122 67.3396 170.0988 90.4836 1.0911 5.8425 26.0359 3.8290 11.2486 29.0095 1.7169 28.6573 41.2624 108.4483 2.8919 2.3597 34.1368 43.6191 213.2908 5.5781 9.8413 57.1086 15.5834 17.7147 9.7318 26.8254 2.3967 11.2860 8.2265 5.5343 0.4575 2.2917 3.5374 5.2054 17.0988 9.4882 13.1313 13.7088 63.9669 41.6437 1.8915 8.6014 9.9071 4.4761 1.1817 2.5516 14.1214 2.9383 6.5916 22.2129 16.5518 1.6941 39.8700 6.3301 35.6862 17.8217 2.7400 0.1959 18.4413 16.1319 8.4484 7.0884 0.9447 3.6557 1.9630 7.6428 8.6981 2.6486 6.4462 14.5476 3.1852 11.5556 16.2171 26.6614 2.8702 41.1632 12.6356 40.0741 44.2139 36.4618 58.1324 27.2744 27.0391 16.6847 50.4216 11.1634 47.8631 18.2483 47.5405 12.1705 29.6265 11.3882 20.1189 8.7134 94.7914 25.4653 35.7873 73.0477 22.1351 18.7291 46.8317 21.8739 32.0176 14.0055 35.1476 36.8561 16.0599 14.8827 9.8200 6.1189 1.5912
temp: 298.150 k
press: 1.00000 atm
elementType: 14 8 8 8 6 6 6 6 6 6 6 6 6 6 6 6 6 6 6 6 6 6 1 1 1 1 1 1 1 1 1 1 1 1 1 1 1 1 1 1 1 1 1 1 1 1 1 1 1 1 1 1 1 1 1 1 1 1
symmnumber: 1
zpe: 1332840.0 jmol-1
zpe.correction: 0.507652 hartree
zpe.thermalcorrener: 0.535823 hartree
zpe.thermalcorrenthalpy: 0.536767 hartree
zpe.thermalcorrgfe: 0.450036 hartree
zpe.sumelectzpe: -1220.802459 hartree
zpe.sumelectthermal: -1220.774289 hartree
zpe.sumelectthermalent: -1220.773345 hartree
zpe.sumelectthermalfe: -1220.860075 hartree
dipole: 0.6489 -1.2511 -3.0637
dipole: 3.3723
quadrupole: -143.4589 -156.5648 -144.2203
quadrupole: 6.4795 5.3254 1.1021
quadrupole: 4.6224 -8.4835 3.8610 6.4795 5.3254 1.1021
hfenergy: -1221.3101114 hartree
pointgroup: C01 [X(C18H36O3Si1)]
dipole: -0.2418745 0.403614 -1.2405396 debye
polarizability: 256.8978746|-0.0332229|220.1587172|-3.0299397|-3.3900332|193.763904 unknown
InChI: InChI=1S/C18H36O3Si/c1-16(2,3)22(6,7)21-15-9-11-18(5,20)14-12-13(19)8-10-17(14,15)4/h13-15,19-20H,8-12H2,1-7H3
charge 0 multiplicity 1
58 atoms
Si -3.066444 0.542404 -0.490291
O  -1.484396 0.309162 0.230449
O  2.757509 2.239485 1.323465
O  4.299492 -2.943394 0.039178
C  0.917636 -0.181829 0.291499
C  2.305328 0.303901 -0.265215
C  -0.192415 0.748866 -0.293043
C  2.603134 1.837935 -0.103343
C  0.662517 -1.648604 -0.229972
C  3.466841 -0.589303 0.259954
C  0.066344 2.236932 0.009896
C  1.40916 2.683219 -0.601308
C  1.947008 -2.420039 -0.642024
C  3.11209 -2.104404 0.309586
C  0.847701 -0.167488 1.843828
C  3.889413 2.244118 -0.860749
C  -4.11497 -0.890999 0.285917
C  -2.937415 0.396193 -2.394996
C  -3.771025 2.254703 -0.0142
C  -3.535048 -2.259427 -0.166299
C  -4.042872 -0.794634 1.83542
C  -5.595215 -0.780395 -0.174113
H  2.252866 0.156547 -1.367975
H  -0.182429 0.616981 -1.403751
H  -0.031666 -1.622073 -1.092084
H  0.139594 -2.212036 0.564863
H  4.347796 -0.470369 -0.400715
H  3.78937 -0.269271 1.270865
H  0.075238 2.400608 1.101223
H  -0.757566 2.847572 -0.407631
H  1.365585 2.607622 -1.707023
H  1.612391 3.740701 -0.350833
H  1.757472 -3.509224 -0.640197
H  2.246701 -2.147596 -1.676981
H  2.837601 -2.407518 1.334197
H  -0.18193 -0.41774 2.153157
H  1.528792 -0.917298 2.285613
H  1.115581 0.817736 2.258004
H  4.0233 3.338512 -0.797769
H  4.788413 1.769951 -0.425679
H  3.838519 1.958929 -1.928226
H  3.521073 1.739084 1.709655
H  4.576519 -2.793142 -0.901743
H  -2.343399 1.222201 -2.8280
H  -2.469234 -0.558645 -2.695473
H  -3.944449 0.438529 -2.851149
H  -3.718707 2.406563 1.07889
H  -3.204087 3.071483 -0.496745
H  -4.828056 2.349007 -0.32596
H  -4.09608 -3.086317 0.314893
H  -3.61449 -2.39741 -1.262028
H  -2.471363 -2.355725 0.11796
H  -4.474662 0.153134 2.210305
H  -2.997696 -0.857414 2.188589
H  -4.615091 -1.627031 2.293583
H  -6.063078 0.164923 0.161033
H  -5.695366 -0.842626 -1.275395
H  -6.185937 -1.613153 0.258389
