program: Gaussian 09
title: 000178287
version: EM64L-G09RevD.01
frameworkgroup: C1[X(C19H22ClN3O3)]
method: RPBEPBE
basis: SDD
operation: Freq
keyword: #p
keyword: freq=noraman
keyword: PBEPBE/SDD
title: #p freq=noraman PBEPBE/SDD
converged: YES YES NO NO
title: Mulliken charges:
elementType: Cl O O O N N N C C C C C C C C C C C C C C C C C C C H H H H H H H H H H H H H H H H H H H H H H
charge: -0.043506 -0.298946 -0.209718 -0.196931 -0.259635 -0.150706 0.015658 -0.240329 0.571006 0.434263 -0.571095 -0.473299 -0.417180 -0.386441 -0.364695 0.708140 -0.688984 -0.693565 0.226698 -0.472250 -0.432010 0.404061 -0.178583 -0.392896 -0.612691 -0.631178 0.210051 0.240481 0.285791 0.235371 0.233193 0.237247 0.255506 0.211250 0.213202 0.228393 0.225071 0.214737 0.211248 0.335959 0.263741 0.292479 0.227847 0.220060 0.280332 0.261571 0.245680 0.225602
chargesum: 0.00000
title: Mulliken charges with hydrogens summed into heavy atoms:
elementType: Cl O O O N N N C C C C C C C C C C C C C C C C C C C
charge: -0.043506 -0.298946 -0.209718 -0.196931 -0.259635 -0.150706 0.015658 -0.030278 0.571006 0.434263 -0.044823 -0.237928 -0.183987 -0.149194 -0.109189 0.708140 -0.036139 -0.042509 0.226698 -0.136291 -0.432010 0.404061 0.085158 -0.100417 0.115547 0.101675
polarizability: 2.45080795e+02 -2.16435079e-03 2.63039241e+02 -1.07489240e+01 -1.46206962e+01 2.49182217e+02
1716.lowfreq: -6.4903 0.0013 0.0014 0.0021 3.5304 5.8654 13.0750 20.9546 26.1838
frequency: 13.0474 20.8003 26.0103 38.5171 47.8121 54.2110 68.8877 75.1436 86.6001 90.8560 124.6858 128.1175 135.6776 149.1682 173.4005 191.1028 208.0587 213.2101 224.7502 238.3905 252.4212 259.7832 269.8813 288.9210 298.5832 332.8356 344.1714 353.9718 392.2854 401.1963 407.7867 425.0069 430.4761 450.4143 484.1031 490.9468 509.6680 521.0079 543.7351 567.2238 578.6780 634.5011 642.8676 651.3127 672.7436 705.8191 716.7472 733.2356 746.4290 751.8475 760.5580 832.3073 835.3051 839.1258 842.5174 890.1824 904.2364 916.0169 945.9102 951.0986 954.7225 964.3551 971.0444 980.6639 1002.9704 1013.8178 1029.6204 1052.5424 1059.6855 1077.5032 1095.3685 1099.2455 1113.4524 1120.7957 1131.9004 1142.4622 1157.8859 1185.3003 1195.8425 1198.7024 1217.4739 1223.9143 1237.4089 1241.7003 1260.8438 1294.0336 1307.7434 1319.4298 1330.6745 1364.6119 1366.4243 1377.3571 1377.5961 1381.7544 1396.1936 1400.8462 1414.2911 1418.9825 1421.0735 1442.5211 1450.9472 1463.8734 1467.1199 1468.3304 1469.4080 1470.5302 1480.8166 1484.7415 1487.3944 1497.1462 1506.0203 1572.5138 1576.4598 1585.8973 1606.9285 1621.0822 2964.1805 2970.2035 2973.2103 2976.5366 2977.8435 3028.8215 3039.7373 3042.1970 3066.4559 3074.1057 3076.1977 3081.3475 3083.4075 3117.2367 3119.9069 3122.1109 3125.5664 3148.3904 3153.0101 3155.3378 3169.3917 3191.8487
redmass: 8.7078 4.2681 3.9098 4.0942 6.9386 5.8009 4.3171 4.0010 8.4319 4.5063 4.4577 2.6967 1.3695 5.2094 6.9159 1.5213 2.0609 3.8746 1.1677 2.5600 2.1028 1.7089 2.3159 5.6920 17.6735 3.7132 2.8928 3.6352 3.5504 3.1074 2.9624 3.8331 4.3866 3.4204 3.5008 6.7561 5.0198 4.9652 2.9918 4.0214 4.2610 6.4972 5.1446 4.2765 6.9579 6.6083 8.0083 4.6901 4.1642 4.9959 5.6602 1.4018 1.6000 2.0667 1.7773 2.5606 5.2413 1.1856 1.9628 1.4114 1.4648 1.4966 1.6855 1.3456 3.3853 4.2660 2.9001 1.5876 1.3921 2.3138 2.0424 1.2304 2.5157 1.5816 1.5276 1.3938 1.6800 2.0849 1.2524 2.4356 6.9120 1.8708 2.6330 5.2205 1.5004 1.6507 1.3277 1.9525 1.7166 1.6418 6.0199 1.3059 2.7948 3.4507 1.2327 2.6994 4.3117 1.1782 2.7204 1.2647 2.1684 1.1814 1.0461 1.0905 1.0510 1.0439 1.0477 1.1205 1.0517 1.2610 2.2639 5.6585 6.6945 6.0079 8.1144 6.3313 1.0368 1.0373 1.0349 1.0369 1.0824 1.0592 1.1011 1.1014 1.1000 1.0992 1.1006 1.0998 1.1026 1.0970 1.0882 1.0876 1.0970 1.0947 1.0957 1.0930 1.0898 1.0968
irintensity: 0.3931 0.2376 0.2245 1.3211 0.6401 1.4182 1.4714 0.4814 4.5861 3.4289 2.0655 0.2612 0.2210 0.2008 2.8086 1.5631 0.3166 3.1989 0.3467 0.5889 0.3877 1.8667 8.4616 1.9575 0.7788 2.9575 1.2372 0.0811 13.2034 4.5055 0.9569 2.2577 6.1554 4.6753 2.4229 16.7085 5.1801 5.9516 11.5509 4.4101 18.7712 0.8622 25.7355 5.3018 1.3466 8.6947 22.7632 4.4838 5.4054 2.9830 22.2115 8.2192 24.4205 39.7170 29.3076 2.3984 16.8654 3.2226 1.7242 0.0826 0.0841 7.3261 24.1287 1.5722 14.0823 49.4027 42.4927 54.1325 2.9492 28.0318 14.6968 1.7641 1.0456 11.6300 24.8997 0.2560 0.9195 146.5535 30.3000 82.5220 300.3314 1.0228 60.9064 27.9895 21.7995 9.4098 0.8256 18.0076 3.8242 53.2652 49.1248 20.0861 266.7196 22.5570 9.4943 15.7113 28.2055 48.8427 6.5998 48.0485 55.9552 49.5442 2.0632 14.9648 4.2647 17.0200 18.4826 7.8691 29.5112 43.1147 155.1394 149.6544 50.9255 202.3966 13.7186 10.1266 35.3913 105.9346 35.3515 34.4258 17.5345 11.3003 68.1551 6.7917 2.0187 103.6993 24.4489 39.6267 6.7355 10.9229 12.9554 22.5545 2.0212 14.9540 2.2239 23.3587 2.2060 2.0980
temp: 298.150 k
press: 1.00000 atm
elementType: 17 8 8 8 7 7 7 6 6 6 6 6 6 6 6 6 6 6 6 6 6 6 6 6 6 6 1 1 1 1 1 1 1 1 1 1 1 1 1 1 1 1 1 1 1 1 1 1
symmnumber: 1
zpe: 993458.6 jmol-1
zpe.correction: 0.378388 hartree
zpe.thermalcorrener: 0.404586 hartree
zpe.thermalcorrenthalpy: 0.405530 hartree
zpe.thermalcorrgfe: 0.319147 hartree
zpe.sumelectzpe: -1585.225185 hartree
zpe.sumelectthermal: -1585.198988 hartree
zpe.sumelectthermalent: -1585.198044 hartree
zpe.sumelectthermalfe: -1585.284426 hartree
dipole: -5.6705 -0.7489 3.6512
dipole: 6.7858
quadrupole: -161.9714 -149.9585 -170.9397
quadrupole: -11.2555 16.2433 -1.3248
quadrupole: -1.0149 10.9980 -9.9832 -11.2555 16.2433 -1.3248
hfenergy: -1585.6035733 hartree
pointgroup: C01 [X(C19H22Cl1N3O3)]
dipole: 2.1942017 -0.3148189 -1.4878886 debye
polarizability: 245.596882|3.5914282|256.7562421|-8.3553174|17.2995651|254.9491288 unknown
InChI: InChI=1S/C19H22ClN3O3/c1-13(2)14-5-7-16(8-6-14)22(19(24)21(3)4)12-15-11-17(23(25)26)9-10-18(15)20/h5-11,13H,12H2,1-4H3
charge 0 multiplicity 1
48 atoms
Cl -1.949787 -0.704476 -3.623943
O  -0.709329 3.315347 0.529109
O  -4.312653 -1.42396 2.674932
O  -2.950025 0.374393 3.008346
N  0.348654 1.626272 -0.71752
N  1.626036 3.262346 0.493811
N  -3.476254 -0.53145 2.255993
C  3.789526 -3.052486 -0.073358
C  2.89733 -1.819961 -0.239596
C  1.215569 0.487045 -0.55967
C  -0.874103 1.478039 -1.548356
C  2.346282 -1.478649 -1.498797
C  2.576959 -0.982309 0.86142
C  1.521827 -0.344664 -1.666251
C  1.745388 0.144311 0.713482
C  -1.831091 0.406313 -1.034594
C  3.152189 -4.092669 0.886912
C  5.216667 -2.668012 0.400629
C  0.376597 2.766715 0.140992
C  -2.21851 0.423705 0.327913
C  -2.377293 -0.614761 -1.848277
C  -3.096563 -0.559176 0.821142
C  -3.262553 -1.598663 -1.356528
C  -3.629975 -1.577331 -0.000364
C  1.698111 4.275063 1.561273
C  2.877198 2.995029 -0.233157
H  3.885365 -3.531164 -1.069176
H  -0.592621 1.267604 -2.593159
H  -1.38649 2.455414 -1.523797
H  2.566458 -2.108556 -2.369666
H  2.965359 -1.221806 1.858728
H  1.119966 -0.116862 -2.659002
H  1.494286 0.756291 1.586451
H  3.046067 -3.678882 1.9071
H  3.784187 -4.997669 0.95439
H  2.147956 -4.394749 0.53948
H  5.692974 -1.95712 -0.298515
H  5.857651 -3.566409 0.472264
H  5.189267 -2.193941 1.399677
H  -1.842336 1.216779 0.982615
H  -3.652648 -2.368551 -2.02759
H  -4.308484 -2.321178 0.423813
H  1.962663 5.267788 1.147128
H  2.463849 3.987891 2.306986
H  0.714414 4.353376 2.046703
H  2.663555 2.536779 -1.209863
H  3.548087 2.316447 0.328423
H  3.404479 3.953508 -0.400335
