program: Gaussian 09
title: 000178272
version: EM64L-G09RevD.01
frameworkgroup: C1[X(C12H18O3)]
method: RPBEPBE
basis: SDD
operation: Freq
keyword: #pfreq=noraman
keyword: PBEPBE/SDD
title: #p freq=noraman PBEPBE/SDD
converged: YES YES NO NO
title: Mulliken charges:
elementType: O O O C C C C C C C C C C C C H H H H H H H H H H H H H H H H H H
charge: -0.302958 -0.294346 -0.443006 -0.185223 0.278938 0.081760 0.137357 -0.719134 -0.729840 0.446585 -0.019056 -0.614097 -0.873804 -0.528259 -0.522734 0.238672 0.257827 0.203973 0.204450 0.222205 0.208383 0.240567 0.249350 0.228280 0.235650 0.253624 0.372405 0.266854 0.211164 0.227354 0.231389 0.216303 0.219372
chargesum: 0.00000
title: Mulliken charges with hydrogens summed into heavy atoms:
elementType: O O O C C C C C C C C C C C C
charge: -0.302958 -0.294346 -0.070602 0.053449 0.278938 0.081760 0.137357 -0.052885 -0.058685 0.446585 -0.019056 -0.364747 -0.156251 0.177112 0.144330
polarizability: 1.72337995e+02 2.40532998e+00 1.65867602e+02 1.10476313e+00 -2.19656804e+00 9.31391115e+01
1716.lowfreq: -9.8256 -3.3503 -0.0003 0.0005 0.0006 7.4946 44.2414 61.2915 82.0220
frequency: 44.2152 61.2856 82.0033 97.6021 101.9229 127.4260 155.0207 163.7743 167.7744 180.0695 208.8563 223.4794 238.0840 244.4221 259.8186 265.3532 271.1608 302.2519 326.8301 344.5566 380.1495 416.9060 430.5133 486.9772 512.8295 524.5947 603.4313 613.8172 654.9626 671.0033 776.1511 814.8686 862.2971 871.0196 890.1839 922.9530 941.2875 957.2834 979.1890 1031.3343 1040.9301 1047.0102 1111.2279 1111.6280 1114.1047 1120.7817 1146.3983 1151.2540 1154.6316 1191.7869 1197.8940 1214.7585 1308.5979 1317.9117 1333.4986 1366.7233 1381.7264 1386.5237 1395.0683 1417.5246 1430.9005 1436.6278 1453.2057 1455.9498 1457.5787 1462.2856 1472.4557 1475.2087 1477.5648 1478.5481 1483.6693 1486.9525 1498.9342 1572.8849 1618.0988 2947.8578 2950.1002 2971.7961 2973.4911 2981.0818 3011.5696 3018.3412 3032.8162 3060.5628 3070.2705 3082.4345 3087.7696 3095.3726 3101.8614 3108.3500 3123.7286 3146.6037 3579.0702
redmass: 2.9261 2.9884 2.9177 2.4501 3.7424 1.9818 1.1014 1.3588 1.1850 2.6074 1.8558 1.2397 1.7985 1.5440 1.6462 2.5831 2.4476 3.6011 4.9370 5.2312 4.7527 2.8732 6.2666 4.5449 3.5365 5.5611 4.1983 4.1446 4.0430 5.2723 5.6982 3.9640 1.6068 4.0532 3.0205 1.1808 4.8842 1.4545 2.0858 1.9637 1.5192 5.5235 1.3630 1.2488 2.1281 2.3931 1.7318 1.5073 1.4358 1.5913 1.8527 2.7241 4.1032 1.9441 1.4302 1.1964 1.6124 1.5814 1.5141 1.8081 1.3842 1.3506 2.0420 1.0877 1.2108 1.0543 1.0546 1.0721 1.0586 1.0491 1.2038 1.0620 1.0752 6.3024 7.5816 1.0319 1.0407 1.0351 1.0360 1.0361 1.0831 1.0972 1.1036 1.0995 1.0991 1.0962 1.0942 1.0993 1.0984 1.1001 1.1049 1.0920 1.0655
irintensity: 5.3519 1.3523 1.8513 5.1830 1.9576 0.4732 1.4465 1.5429 0.2975 4.5211 3.0709 0.2903 10.6716 9.2954 63.8419 15.4416 26.6483 0.8796 6.4589 8.5523 2.9368 1.7948 0.3902 7.7456 0.5813 6.5006 5.2006 5.0382 0.6650 2.1273 2.3256 49.2796 16.0992 33.2754 21.0016 3.6521 39.9320 0.0279 12.2079 20.6414 4.0192 120.5632 21.1089 0.7144 13.2396 38.2912 2.0765 4.2003 5.0164 108.5353 135.6576 78.0704 14.9052 25.8919 10.6469 19.7007 10.3040 4.7430 33.0018 13.1202 38.0060 8.8721 26.3779 3.2377 17.5439 3.2719 9.8649 29.1020 19.8643 6.5195 37.7207 3.6946 14.7257 13.5338 6.7266 70.2670 43.8036 80.6341 39.2816 46.3431 9.3618 23.4612 50.4088 38.5992 53.3463 39.9200 11.7663 3.7726 38.6102 36.1296 13.2567 7.0596 33.9623
temp: 298.150 k
press: 1.00000 atm
elementType: 8 8 8 6 6 6 6 6 6 6 6 6 6 6 6 1 1 1 1 1 1 1 1 1 1 1 1 1 1 1 1 1 1
symmnumber: 1
zpe: 719682.9 jmol-1
zpe.correction: 0.274113 hartree
zpe.thermalcorrener: 0.291718 hartree
zpe.thermalcorrenthalpy: 0.292662 hartree
zpe.thermalcorrgfe: 0.229795 hartree
zpe.sumelectzpe: -692.540412 hartree
zpe.sumelectthermal: -692.522806 hartree
zpe.sumelectthermalent: -692.521862 hartree
zpe.sumelectthermalfe: -692.584729 hartree
dipole: 2.2713 1.3744 0.4331
dipole: 2.6898
quadrupole: -77.0030 -83.5259 -95.0959
quadrupole: 1.6304 -3.6614 7.1865
quadrupole: 8.2053 1.6824 -9.8877 1.6304 -3.6614 7.1865
hfenergy: -692.8145246 hartree
pointgroup: C01 [X(C12H18O3)]
dipole: -0.9064678 0.5164393 -0.177568 debye
polarizability: 172.4483662|-2.2379338|165.8397134|0.2113201|-0.2349765|93.0566296 unknown
InChI: InChI=1S/C12H18O3/c1-7(2)10-9(14-4)6-8(3)11(13)12(10)15-5/h6-7,13H,1-5H3
charge 0 multiplicity 1
33 atoms
O  -0.343338 -2.210961 -0.366481
O  1.773028 2.108795 0.515838
O  -2.865647 -0.965676 -0.39542
C  2.12219 -0.747791 0.109521
C  0.741038 -0.088814 0.082816
C  -0.461325 -0.828842 -0.111375
C  0.612901 1.316419 0.264403
C  2.491016 -1.390092 -1.255643
C  2.264345 -1.771317 1.268366
C  -1.830849 1.228008 0.07605
C  -1.722975 -0.171255 -0.137558
C  -0.641644 1.960798 0.273661
C  -3.192581 1.902532 0.075156
C  -1.151318 -3.131911 0.461067
C  2.343755 2.726298 -0.69378
H  2.841513 0.067643 0.312159
H  1.796486 -2.211432 -1.498182
H  3.520437 -1.794467 -1.219661
H  2.443957 -0.647148 -2.074117
H  2.012258 -1.308279 2.239668
H  3.307815 -2.135064 1.323104
H  1.605513 -2.640834 1.108057
H  -0.67937 3.040259 0.454585
H  -3.709526 1.811751 -0.902997
H  -3.865169 1.490539 0.854527
H  -3.08871 2.980937 0.277688
H  -3.666376 -0.390887 -0.478605
H  -2.227408 -2.98612 0.276589
H  -0.92648 -2.98214 1.535323
H  -0.836336 -4.140157 0.150048
H  3.207131 3.318652 -0.352367
H  1.60529 3.388636 -1.188013
H  2.677981 1.955324 -1.416927
