program: Gaussian 09
title: 000178239
version: EM64L-G09RevD.01
frameworkgroup: C1[X(C4H6O4)]
method: RPBEPBE
basis: SDD
operation: Freq
keyword: #p
keyword: freq=noraman
keyword: PBEPBE/SDD
title: #p freq=noraman PBEPBE/SDD
converged: YES YES NO NO
title: Mulliken charges:
elementType: O O O O C C C C H H H H H H
charge: -0.448883 -0.401793 -0.235995 -0.184105 -0.146217 -0.432968 0.148604 -0.033447 0.255471 0.257013 0.263254 0.195935 0.368397 0.394734
chargesum: 0.00000
title: Mulliken charges with hydrogens summed into heavy atoms:
elementType: O O O O C C C C
charge: -0.080486 -0.007058 -0.235995 -0.184105 0.109254 0.087298 0.148604 0.162488
polarizability: 7.33456781e+01 1.74747988e-01 5.28617180e+01 -2.69333004e+00 -1.23841825e+00 4.12656838e+01
1716.lowfreq: -52.0292 -6.5050 -0.0008 0.0010 0.0010 3.2499 5.6765 48.2187 88.1179
frequency: -51.9446 48.1764 88.1030 133.2480 239.5506 289.2967 319.0958 367.7681 448.5303 498.5866 594.4348 609.1732 686.1394 715.2701 850.3272 931.4922 1025.1806 1031.7560 1061.0305 1087.4273 1188.0399 1219.9324 1262.8769 1296.3846 1321.2501 1385.3403 1395.0356 1411.0869 1645.8070 1646.6124 2907.4657 2995.9984 3015.8015 3062.9074 3483.1340 3516.6869
redmass: 3.1645 9.8894 2.5837 5.2850 4.9709 3.4749 1.5638 2.5225 3.9276 3.5732 1.4134 3.3023 2.0178 2.5301 3.6018 2.5535 3.2470 3.3976 3.1094 2.3072 1.1796 1.2725 1.4413 1.7734 1.2167 1.5483 1.2118 1.1217 8.8600 8.8526 1.0869 1.0602 1.0845 1.0995 1.0654 1.0643
irintensity: 16.6509 4.7403 3.7018 3.0990 6.4426 26.9280 99.9688 37.1949 3.4265 17.8580 120.0061 25.9142 57.2881 7.2276 54.9058 6.9470 65.0245 284.3406 36.7018 30.6961 18.0130 11.1186 22.4444 77.8982 0.0551 15.5612 4.5515 21.4173 316.9762 86.9151 82.1805 5.4055 18.0636 9.3534 36.2569 38.8198
temp: 298.150 k
press: 1.00000 atm
elementType: 8 8 8 8 6 6 6 6 1 1 1 1 1 1
symmnumber: 1
zpe: 261856.3 jmol-1
zpe.correction: 0.099736 hartree
zpe.thermalcorrener: 0.107875 hartree
zpe.thermalcorrenthalpy: 0.108819 hartree
zpe.thermalcorrgfe: 0.066073 hartree
zpe.sumelectzpe: -456.269982 hartree
zpe.sumelectthermal: -456.261843 hartree
zpe.sumelectthermalent: -456.260899 hartree
zpe.sumelectthermalfe: -456.303645 hartree
dipole: 3.4751 -1.8970 0.6963
dipole: 4.0199
quadrupole: -57.3637 -46.9589 -45.7308
quadrupole: -6.6295 -1.9156 -0.5774
quadrupole: -7.3459 3.0589 4.2870 -6.6295 -1.9156 -0.5774
hfenergy: -456.3697174 hartree
pointgroup: C01 [X(C4H6O4)]
dipole: -1.4252235 -0.6785444 -0.0982773 debye
dipolederiv: -0.4248455 -0.046626 -0.1598154 0.0567843 -0.7444202 0.1067004 -0.1716351 0.0974676 -0.4234398 -0.4744592 -0.3697689 -0.0770224 -0.3858664 -1.1141173 -0.0217183 -0.0469407 0.0316842 -0.3659793 -0.757798 0.2465257 0.1445874 0.0754943 -0.8552739 -0.0697118 0.2311066 -0.1967296 -0.3746001 -0.9993105 0.0874716 -0.0683299 0.1146373 -0.3613533 0.0567722 -0.2100639 0.069309 -0.4551097 -0.0924773 -0.047317 0.1686581 0.047261 0.5927963 -0.0656369 0.1686844 -0.0167477 0.3095847 -0.3998456 0.0186879 0.0781559 -0.2184875 0.0330666 0.1042969 0.3934485 0.1212102 -0.1043972 1.1746646 0.0087851 -0.2452929 0.1788458 1.4584337 0.1696153 -0.3945929 0.2184274 0.3065454 1.2917732 -0.0876619 -0.0098105 0.0067777 0.2372443 -0.2393931 -0.118841 -0.222537 0.6613729 0.0947416 -0.0057824 0.0144246 -0.0142103 -0.0247792 -0.0467388 -0.035526 -0.0805246 -0.0609475 0.0334294 0.0282883 0.0075576 0.0372554 0.0816243 -0.072901 -0.0201317 -0.049416 -0.0321049 0.0624125 -0.0099017 -0.0132551 0.0084015 -0.0581291 0.0209787 -0.0217997 0.0054045 0.118338 0.0035699 0.0126745 -0.0196083 -0.0156212 0.0697908 0.1206926 0.0279906 0.123348 -0.1906831 0.2978 0.1301847 0.0777819 0.019484 0.3568818 -0.027631 0.0852021 -0.0768108 0.2606859 0.1903449 0.03444 0.101969 0.089244 0.3282351 -0.0353252 0.1130989 -0.0240851 0.3507347 unknown
polarizability: 73.1425209|-2.4597442|53.0090534|-2.2826804|-1.5274163|41.3215057 unknown
InChI: InChI=1S/C4H6O4/c5-2-1-3(6)4(7)8/h2-3,6-7H,1H2
charge 0 multiplicity 1
14 atoms
O  0.049526 1.510763 -0.807613
O  -2.038723 -1.430058 -0.118227
O  -2.342498 0.829902 0.360876
O  3.272109 -0.678057 0.369587
C  -0.227208 0.090231 -0.641186
C  0.828184 -0.564646 0.282085
C  -1.636687 -0.102601 -0.087935
C  2.24136 -0.361728 -0.266022
H  -0.178241 -0.37691 -1.643306
H  0.78066 -0.137821 1.301514
H  0.641796 -1.652911 0.377233
H  2.307425 0.083234 -1.289287
H  -0.626154 2.025578 -0.286911
H  -2.953648 -1.525077 0.262593
