program: Gaussian 09
title: 000178315
version: EM64L-G09RevD.01
frameworkgroup: C1[X(C19H34Br2O2Si)]
method: RPBEPBE
basis: SDD
operation: Freq
keyword: #p
keyword: freq=noraman
keyword: PBEPBE/SDD
title: #p freq=noraman PBEPBE/SDD
converged: NO YES NO NO
title: Mulliken charges:
elementType: Br Br Si O O C C C C C C C C C C C C C C C C C C C H H H H H H H H H H H H H H H H H H H H H H H H H H H H H H H H H H
charge: 0.061091 0.032577 1.441363 -0.646282 -0.458189 -0.204124 -0.106334 -0.114353 0.408688 -0.549312 -0.450900 0.227913 -0.558941 0.005873 -0.467291 -0.486482 -0.835291 -0.761851 -0.157887 -1.062417 -1.059881 -0.697647 -0.696529 -0.703911 0.251984 0.201583 0.282981 0.227297 0.227235 0.221499 0.255479 0.167199 0.192794 0.228492 0.247562 0.205303 0.258583 0.241333 0.217150 0.226038 0.233951 0.226776 0.329567 0.241457 0.235704 0.248106 0.249083 0.233421 0.237570 0.208051 0.207644 0.234330 0.209098 0.243173 0.205221 0.214888 0.213556 0.216009
chargesum: 0.00000
title: Mulliken charges with hydrogens summed into heavy atoms:
elementType: Br Br Si O O C C C C C C C C C C C C C C C C C C C
charge: 0.061091 0.032577 1.441363 -0.646282 -0.128622 0.047860 0.095249 0.168628 0.408688 -0.549312 0.003632 0.227913 -0.081962 0.173072 -0.046005 -0.033618 -0.118225 -0.075087 -0.157887 -0.337150 -0.339807 -0.047623 -0.039037 -0.059457
polarizability: 3.21744673e+02 -3.17179466e+00 2.36327652e+02 5.05755021e+00 -1.25400932e+00 2.34446640e+02
1716.lowfreq: -37.5951 -15.6196 -10.9323 -5.6803 -0.0014 -0.0013 -0.0006 3.6744 21.4425
frequency: -36.8404 -14.0704 21.3445 29.3272 47.3740 52.8276 66.9149 82.5739 88.5971 112.1055 117.1338 125.9404 138.1755 145.3667 163.6261 171.8795 185.4423 196.3804 199.7868 201.9975 207.6245 209.6899 220.7170 231.7526 238.9852 250.1931 255.9310 260.0406 268.8035 278.4102 289.3619 306.1629 316.9391 320.7452 334.8347 364.0327 378.8272 383.6732 389.1340 391.8875 428.2901 435.5722 439.0034 458.8105 493.1699 530.7518 553.3824 562.9716 593.7983 643.8284 654.7163 680.2381 688.2041 743.0221 751.7279 754.2290 765.8602 785.6208 807.7241 811.1520 813.5241 843.2365 855.0424 878.9230 893.7400 898.4584 911.4057 932.6546 934.6726 940.7357 945.4247 947.2192 965.1980 988.8386 994.6197 1003.3556 1007.7694 1010.6285 1020.2199 1031.4107 1044.5154 1058.4792 1062.9791 1084.0552 1098.5120 1127.4322 1144.5813 1148.1645 1171.8865 1180.2795 1196.9425 1198.0694 1201.6647 1206.3115 1223.9693 1248.9947 1251.9434 1257.9587 1272.9773 1290.9369 1291.7661 1298.9290 1302.7647 1313.6815 1322.1009 1333.0938 1339.4213 1343.7941 1358.6168 1361.9833 1369.6790 1372.2703 1373.3212 1384.8262 1387.7735 1397.3924 1436.8447 1440.5207 1447.7445 1448.2581 1450.6272 1461.3283 1461.8612 1466.3901 1468.7274 1469.0328 1470.0832 1472.2626 1475.0529 1479.8343 1480.6207 1483.6285 1493.3619 1506.8649 2872.2626 2944.0069 2953.0825 2953.7322 2958.0895 2974.5615 2976.5959 2979.3266 2980.7256 2981.4671 2991.6700 2994.6965 3009.3568 3036.5887 3040.5240 3040.8642 3047.0769 3051.2952 3054.6595 3058.0963 3064.4214 3069.1312 3073.8749 3074.6357 3076.4130 3078.9633 3080.6441 3085.0396 3088.7432 3088.8007 3089.8726 3107.3645 3112.2049 3555.5450
redmass: 1.2309 3.4688 5.2295 4.0661 2.8431 3.0076 7.7412 5.2540 3.1126 1.5752 3.4090 3.3204 3.0463 2.9698 3.0227 2.1557 1.9600 2.6532 2.0588 1.2694 2.0585 1.7483 1.8345 1.8131 1.3463 1.8495 1.8628 1.1272 2.2425 2.5786 2.8916 3.3180 3.2778 2.6244 3.2215 2.9557 2.5946 2.4863 2.5356 4.1544 3.4170 3.5033 3.1552 4.2412 2.9339 3.1554 2.6998 3.3210 3.4146 3.5969 3.9462 3.4738 2.5549 4.2262 3.1929 2.6536 3.2998 1.2351 1.9375 2.1492 2.5897 3.3222 2.3762 1.7813 1.5573 2.0105 1.8948 1.8082 1.5190 1.7008 2.0430 1.3242 2.0423 2.3015 1.7123 1.4219 1.9247 1.3838 1.8649 2.8958 1.9836 1.9829 1.7178 2.1811 1.9531 1.9648 1.7977 2.0684 2.1767 1.6861 2.8083 2.0571 2.7475 2.2866 1.3228 1.7465 1.6282 1.4568 1.4112 1.2698 1.3801 1.2099 1.4855 1.2938 1.5117 1.5519 1.4384 1.4556 1.4509 1.5348 1.1911 1.1866 1.9335 1.2213 1.2085 1.1952 1.0553 1.0532 1.0527 1.0835 1.0511 1.0501 1.0711 1.0480 1.0592 1.0559 1.0680 1.0531 1.0841 1.0680 1.0558 1.0490 1.0534 1.0590 1.0824 1.0810 1.0355 1.0363 1.0366 1.0385 1.0615 1.0352 1.0349 1.0608 1.0575 1.0407 1.0629 1.0982 1.0983 1.0983 1.0962 1.0978 1.1000 1.0995 1.0978 1.0992 1.0998 1.0989 1.0975 1.0971 1.0981 1.0996 1.0883 1.0971 1.0984 1.0984 1.0896 1.0657
irintensity: 0.2278 0.0301 0.0794 0.0538 0.1896 0.3329 0.6711 0.4785 3.1788 0.0668 0.0067 0.2801 0.5016 0.3664 0.3590 6.5866 18.6143 15.7415 4.0505 1.7844 4.5462 74.5093 27.3699 2.6003 1.3545 3.2409 2.3179 0.3582 4.1448 1.2633 0.5338 8.0828 9.1780 1.0325 8.8115 8.1584 6.4942 4.7744 2.0830 5.6705 0.7650 8.3122 1.8529 10.9704 5.6264 1.1297 1.5313 5.5514 13.2375 54.4600 15.6497 33.0198 15.2169 22.8243 13.7508 26.1618 8.4172 0.2001 22.4019 48.6405 12.8649 15.5172 14.8803 168.7040 112.4933 81.8773 14.4113 1.7984 2.8942 10.0598 2.6722 2.1181 3.9506 6.5073 13.4039 23.9638 12.0122 3.6553 30.6990 260.8132 95.8036 37.3353 1.3425 12.3211 23.0465 5.7790 11.3725 10.2799 7.1841 9.8738 0.7721 2.7050 2.0439 4.4521 2.3474 15.3561 8.5070 12.6323 15.6360 26.0375 33.7641 40.3245 27.3778 0.9190 4.8474 1.2055 6.5214 7.5302 3.5181 30.0361 14.2800 18.6321 1.3741 21.3288 15.9175 19.5193 1.8179 1.1953 17.3701 3.7225 25.8995 0.7002 6.8490 0.4616 6.5884 4.9336 3.6737 12.3520 7.4040 13.4464 6.7602 17.5069 31.7422 6.1183 38.3797 8.6139 36.3918 39.3837 62.3010 12.9499 23.8822 10.5578 9.8221 43.7991 21.6840 33.0087 38.2235 11.6621 10.7289 8.4370 110.1504 26.3043 34.7369 30.9812 21.7145 22.8228 12.9766 58.4558 4.0067 43.6151 37.7089 29.7998 11.7746 14.5452 14.7973 9.1250 9.6934 4.5381
temp: 298.150 k
press: 1.00000 atm
elementType: 35 35 14 8 8 6 6 6 6 6 6 6 6 6 6 6 6 6 6 6 6 6 6 6 1 1 1 1 1 1 1 1 1 1 1 1 1 1 1 1 1 1 1 1 1 1 1 1 1 1 1 1 1 1 1 1 1 1
symmnumber: 1
zpe: 1282535.1 jmol-1
zpe.correction: 0.488492 hartree
zpe.thermalcorrener: 0.517402 hartree
zpe.thermalcorrenthalpy: 0.518346 hartree
zpe.thermalcorrgfe: 0.429830 hartree
zpe.sumelectzpe: -1209.261312 hartree
zpe.sumelectthermal: -1209.232401 hartree
zpe.sumelectthermalent: -1209.231457 hartree
zpe.sumelectthermalfe: -1209.319973 hartree
dipole: 1.9920 0.0420 0.5038
dipole: 2.0551
quadrupole: -180.1624 -178.1889 -171.8347
quadrupole: -8.1962 8.9462 4.4619
quadrupole: -3.4337 -1.4602 4.8940 -8.1962 8.9462 4.4619
hfenergy: -1209.7498035 hartree
pointgroup: C01 [X(C19H34Br2O2Si1)]
dipole: 0.7797182 -0.1682771 -0.132176 debye
polarizability: 321.3064675|-8.5567559|236.2576597|-0.2446354|-1.4464507|234.954837 unknown
InChI: InChI=1S/C19H34Br2O2Si/c1-16(2,3)24(6,7)23-13-9-11-18(5,22)15-14-12(19(14,20)21)8-10-17(13,15)4/h12-15,22H,8-11H2,1-7H3
charge 0 multiplicity 1
58 atoms
Br -5.761299 1.541778 -0.118307
Br -3.417757 1.476226 -2.424562
Si 3.407463 -0.272638 -0.707221
O  1.915889 -0.306811 0.21663
O  -2.152461 -2.345391 1.679391
C  -3.048497 0.338182 0.422801
C  -1.887192 -0.52987 -0.077667
C  -2.84223 1.88552 0.564146
C  -0.509529 0.071627 0.385359
C  -3.798402 1.318535 -0.474662
C  -1.471644 2.494372 0.249116
C  -2.106553 -2.05324 0.220021
C  -0.408259 1.485584 -0.263015
C  0.620046 -0.826637 -0.215017
C  -0.895043 -2.863601 -0.29676
C  0.459608 -2.305261 0.188615
C  -0.353373 0.172662 1.923995
C  -3.41339 -2.557937 -0.430486
C  4.563683 0.830301 0.388301
C  3.064864 0.497131 -2.424989
C  4.103958 -2.040008 -0.930094
C  3.92815 2.23736 0.560767
C  4.72755 0.173164 1.787215
C  5.956236 0.969754 -0.287569
H  -3.68097 -0.115879 1.196741
H  -1.876291 -0.469749 -1.188565
H  -3.359341 2.358739 1.407849
H  -1.10769 2.954289 1.186248
H  -1.58935 3.319804 -0.480083
H  -0.496532 1.375197 -1.362701
H  0.598176 1.894645 -0.059554
H  0.541031 -0.757202 -1.329053
H  -0.926187 -2.861807 -1.405358
H  -1.018268 -3.91058 0.03516
H  0.537402 -2.400196 1.285438
H  1.286768 -2.895243 -0.249555
H  -0.448621 -0.812457 2.406305
H  0.641038 0.590735 2.158191
H  -1.124262 0.82967 2.364374
H  -3.40165 -2.406892 -1.5253
H  -3.538908 -3.6359 -0.225307
H  -4.30099 -2.026847 -0.036968
H  -2.992733 -1.978551 2.055504
H  4.00213 0.595464 -3.00387
H  2.375951 -0.132911 -3.018025
H  2.611995 1.500348 -2.331499
H  4.204304 -2.552313 0.043496
H  3.442188 -2.65179 -1.570891
H  5.1006 -2.013664 -1.409606
H  4.572445 2.86662 1.207909
H  3.814999 2.76227 -0.407296
H  2.931479 2.166843 1.033567
H  5.215325 -0.818369 1.722964
H  3.748726 0.041529 2.28311
H  5.360065 0.814415 2.434411
H  6.454886 -0.010147 -0.415726
H  5.889574 1.45422 -1.280952
H  6.617994 1.597509 0.342735
