program: Gaussian 09
title: 000178278
version: EM64L-G09RevD.01
frameworkgroup: C1[X(C19H24N2O)]
method: RPBEPBE
basis: SDD
operation: Freq
keyword: #p
keyword: freq=noraman
keyword: PBEPBE/SDD
title: #p freq=noraman PBEPBE/SDD
converged: YES YES NO NO
title: Mulliken charges:
elementType: O N N C C C C C C C C C C C C C C C C C C C H H H H H H H H H H H H H H H H H H H H H H H H
charge: -0.312024 -0.253468 -0.148334 -0.240218 0.572435 0.444431 -0.576720 -0.474343 -0.409199 -0.337476 -0.412659 -0.692801 -0.691715 0.489992 0.226517 -0.396724 -0.380359 -0.613364 -0.631505 -0.229359 -0.229945 -0.240625 0.210272 0.207250 0.261916 0.232405 0.228650 0.249407 0.231472 0.225151 0.212997 0.209671 0.230622 0.211383 0.209302 0.217488 0.289780 0.224482 0.216407 0.275281 0.221783 0.259880 0.243478 0.221006 0.222963 0.224420
chargesum: 0.00000
title: Mulliken charges with hydrogens summed into heavy atoms:
elementType: O N N C C C C C C C C C C C C C C C C C C C
charge: -0.312024 -0.253468 -0.148334 -0.029947 0.572435 0.444431 -0.107554 -0.241938 -0.180549 -0.088070 -0.181187 -0.044982 -0.040408 0.489992 0.226517 -0.179236 -0.090579 0.102806 0.093636 -0.008353 -0.006982 -0.016205
polarizability: 2.49895324e+02 1.82209656e+01 2.30573104e+02 -1.45057165e+01 -1.92897715e+00 1.77746757e+02
1716.lowfreq: -8.3087 -2.4718 -0.0008 -0.0006 -0.0004 7.4499 17.4277 24.2677 30.2238
frequency: 17.2527 24.2210 30.2190 46.8038 60.9190 62.3738 73.7253 94.8811 105.1792 129.6089 139.7779 168.2423 186.8964 210.7662 214.3356 227.7687 242.3904 251.8692 253.6631 292.1827 333.4680 353.1937 387.1533 406.5790 408.0124 409.3199 417.5912 429.1028 467.3162 495.1952 535.7898 563.7397 571.7046 617.3258 633.5971 643.8640 649.3281 709.9944 712.6518 745.0068 751.0288 762.2655 812.0318 833.5012 839.4062 844.0203 864.9674 890.0015 917.3409 933.0166 948.2628 951.3311 953.1862 966.0005 986.1064 989.3683 996.7863 1006.2673 1014.7403 1027.1052 1052.4201 1057.6015 1058.1859 1088.3466 1099.9935 1112.6252 1116.6698 1139.8855 1156.0567 1170.9505 1187.0557 1188.9247 1191.3514 1210.3409 1222.7053 1230.3592 1243.3491 1294.6389 1306.1012 1306.9030 1326.3700 1337.0054 1363.3909 1376.6005 1377.8793 1380.3275 1388.7687 1395.3442 1416.2186 1419.1600 1439.5013 1444.0390 1461.3182 1466.5303 1466.9825 1467.8202 1470.8429 1479.3259 1481.7255 1483.6629 1486.0610 1497.8152 1505.6301 1568.9168 1581.0291 1593.4474 1614.0334 1620.2616 2958.5423 2965.6640 2972.7842 2975.5054 2978.6050 3014.5747 3031.9428 3035.7993 3064.8620 3072.0444 3076.7537 3081.4307 3083.1402 3112.6138 3112.9992 3116.4175 3117.7581 3122.0123 3122.8909 3134.3247 3143.2292 3144.9847 3151.5979 3159.5046
redmass: 3.5699 4.0834 3.4770 3.7435 3.4832 3.6665 3.5217 1.3418 3.1844 3.4484 4.2412 3.1630 1.2130 1.6544 1.6639 3.0052 3.0329 1.2199 2.8649 3.2180 3.3727 3.2681 3.0462 3.0553 2.8908 3.0569 2.5365 4.2880 3.5178 3.3926 3.3733 3.4287 3.7365 6.1922 6.3960 4.0336 3.9980 2.0128 6.2735 3.3073 3.8902 2.3422 3.3745 1.2998 3.0379 1.7210 1.2454 2.5628 1.1807 1.4731 2.5274 1.4158 1.4329 1.3834 1.3530 6.0274 2.7466 1.6321 2.1670 2.2605 1.5324 2.0429 1.6127 1.6179 1.2269 2.5519 1.5033 1.3898 1.7332 1.0597 1.6125 1.1790 1.2490 2.6792 1.8662 2.7410 5.5181 1.6272 1.7005 1.4018 1.7257 1.4101 1.4309 1.1975 3.0857 3.8794 3.6189 1.2208 1.1742 2.7327 1.4552 1.7101 1.1291 1.0674 1.0460 1.0512 1.0471 1.0485 2.1481 1.1177 1.0507 1.2738 2.3337 5.1288 6.5893 6.0519 5.9849 6.3896 1.0372 1.0377 1.0349 1.0354 1.0842 1.0628 1.1006 1.1012 1.1000 1.0991 1.1005 1.0997 1.0998 1.0864 1.0963 1.0880 1.0877 1.0869 1.0962 1.0919 1.0953 1.0962 1.0956 1.1016
irintensity: 0.8430 0.3845 0.2041 1.3764 1.2049 1.1787 0.9710 1.0174 4.9716 0.5143 0.4227 0.6466 0.3083 0.4055 0.3893 0.9373 4.7061 0.0124 3.0674 1.9854 4.0555 0.5108 7.4133 4.6990 0.4906 0.0720 7.8132 3.4390 4.4050 0.5543 4.6345 15.0208 17.1215 0.5888 1.1145 44.0812 2.6043 66.7148 16.6268 11.8946 7.0434 21.5562 1.7105 1.0736 14.7863 41.5555 0.3703 1.9066 2.7845 2.2210 19.6518 1.5762 0.3908 0.9620 0.5341 0.4554 12.7035 8.1589 4.3295 6.3649 29.6655 18.9827 6.0374 42.3967 1.5580 1.8564 10.3580 0.0744 0.5305 1.5001 162.9401 20.5031 72.5838 17.4130 2.9243 71.5985 21.0138 10.1191 14.1674 2.3794 2.8210 4.7818 69.0037 19.6288 144.6824 10.2227 71.0966 15.0448 51.1067 8.9428 51.3034 15.1597 42.8874 13.9376 0.7560 4.7920 10.9461 16.2873 23.5168 9.1944 23.9532 66.9817 150.7761 244.2593 93.3583 2.7338 1.7147 7.6274 47.8843 112.0700 31.6449 39.7610 17.0702 33.8177 64.0077 19.4246 0.6386 107.2242 24.4058 41.0257 3.0045 8.7479 12.2654 9.4128 29.8582 5.0232 2.8492 20.5581 17.7973 20.8306 3.6982 35.3464
temp: 298.150 k
press: 1.00000 atm
elementType: 8 7 7 6 6 6 6 6 6 6 6 6 6 6 6 6 6 6 6 6 6 6 1 1 1 1 1 1 1 1 1 1 1 1 1 1 1 1 1 1 1 1 1 1 1 1
symmnumber: 1
zpe: 1015056.5 jmol-1
zpe.correction: 0.386615 hartree
zpe.thermalcorrener: 0.408952 hartree
zpe.thermalcorrenthalpy: 0.409896 hartree
zpe.thermalcorrgfe: 0.332892 hartree
zpe.sumelectzpe: -921.532415 hartree
zpe.sumelectthermal: -921.510078 hartree
zpe.sumelectthermalent: -921.509134 hartree
zpe.sumelectthermalfe: -921.586138 hartree
dipole: -3.9478 1.0747 0.3098
dipole: 4.1032
quadrupole: -139.9463 -120.2048 -123.3066
quadrupole: -1.0136 -1.7441 -1.4073
quadrupole: -12.1271 7.6144 4.5127 -1.0136 -1.7441 -1.4073
hfenergy: -921.9190299 hartree
pointgroup: C01 [X(C19H24N2O1)]
dipole: 1.6095102 0.0402151 0.1176889 debye
polarizability: 238.507943|21.291491|242.4638505|12.0789082|2.1664387|177.2433919 unknown
InChI: InChI=1S/C19H24N2O/c1-15(2)17-10-12-18(13-11-17)21(19(22)20(3)4)14-16-8-6-5-7-9-16/h5-13,15H,14H2,1-4H3
charge 0 multiplicity 1
46 atoms
O  -2.377586 -2.665166 0.025537
N  -0.728916 -1.187932 0.825357
N  -0.159186 -3.391892 0.061551
C  4.161562 1.598535 -0.737918
C  2.886689 0.860367 -0.32255
C  0.487917 -0.522295 0.438923
C  -1.797894 -0.36498 1.476643
C  2.17139 0.060702 -1.248494
C  2.370655 0.955017 0.996517
C  0.986481 -0.613778 -0.88504
C  1.19698 0.273871 1.376077
C  5.39562 1.113556 0.069541
C  3.997288 3.137438 -0.616598
C  -2.343562 0.757088 0.598168
C  -1.147026 -2.429714 0.274837
C  -2.064455 2.112459 0.901652
C  -3.146466 0.4551 -0.533524
C  -0.510456 -4.584882 -0.72527
C  1.148766 -3.424334 0.733898
C  -2.575074 3.15367 0.092193
C  -3.656169 1.493825 -1.342592
C  -3.37277 2.846144 -1.03311
H  4.347724 1.36534 -1.805963
H  -1.390421 0.053767 2.414682
H  -2.604823 -1.070733 1.734564
H  2.537281 -0.021374 -2.279795
H  2.894878 1.562653 1.744244
H  0.438101 -1.203212 -1.627556
H  0.834614 0.351416 2.407233
H  5.543178 0.024019 -0.040032
H  6.312802 1.625442 -0.276972
H  5.27527 1.331941 1.147285
H  3.138429 3.495544 -1.211946
H  4.907989 3.655069 -0.971629
H  3.827796 3.436471 0.434765
H  -1.442952 2.354923 1.773178
H  -3.359206 -0.596297 -0.759558
H  -0.589204 -5.481131 -0.077808
H  0.26141 -4.774072 -1.495956
H  -1.486578 -4.420717 -1.204736
H  1.336376 -4.451408 1.101848
H  1.156992 -2.739736 1.594971
H  1.97626 -3.136226 0.056395
H  -2.351695 4.198277 0.337918
H  -4.278963 1.251394 -2.211547
H  -3.771446 3.650852 -1.661685
