program: Gaussian 09
title: 000178284
version: EM64L-G09RevD.01
frameworkgroup: C1[X(C21H29N3O)]
method: RPBEPBE
basis: SDD
operation: Freq
keyword: #p
keyword: freq=noraman
keyword: PBEPBE/SDD
title: #p freq=noraman PBEPBE/SDD
converged: YES YES NO NO
title: Mulliken charges:
elementType: O N N N C C C C C C C C C C C C C C C C C C C C C H H H H H H H H H H H H H H H H H H H H H H H H H H H H H
charge: -0.312175 -0.251859 -0.147980 -0.168712 -0.239822 -0.593846 0.574062 0.449253 0.554464 -0.474344 -0.414734 -0.383325 -0.360489 -0.690732 -0.694939 0.218928 -0.530757 0.426228 -0.462192 -0.385086 -0.233622 -0.613735 -0.631560 -0.644899 -0.645257 0.208337 0.206536 0.257405 0.230453 0.227511 0.228521 0.245979 0.209404 0.209717 0.230951 0.224827 0.211788 0.210586 0.298399 0.215887 0.234179 0.211737 0.224036 0.215743 0.274363 0.260977 0.243543 0.220050 0.228660 0.228791 0.213474 0.208727 0.239516 0.237031
chargesum: 0.00000
title: Mulliken charges with hydrogens summed into heavy atoms:
elementType: O N N N C C C C C C C C C C C C C C C C C C C C C
charge: -0.312175 -0.251859 -0.147980 -0.168712 -0.031486 -0.129905 0.574062 0.449253 0.554464 -0.243891 -0.187223 -0.154803 -0.114510 -0.040660 -0.047738 0.218928 -0.232358 0.426228 -0.246304 -0.150907 -0.021884 0.100407 0.093010 0.026026 0.040018
polarizability: 2.78458504e+02 1.39087682e+01 2.65113540e+02 -1.94202567e+01 -1.35630480e+01 2.25087730e+02
1716.lowfreq: -8.7403 -5.9854 -1.5095 -0.0008 -0.0004 0.0005 7.1217 9.7476 28.1431
frequency: -1.9349 9.4649 28.1345 35.7363 52.4979 59.5725 71.5166 73.0362 76.9699 91.2263 123.8185 127.4323 130.4577 136.2172 149.4016 177.3026 187.1192 200.1320 205.0158 225.2248 238.2867 242.0582 261.8658 264.7655 274.5961 286.0019 333.6406 353.8738 374.6974 390.0752 400.8764 409.1039 423.7182 427.7600 452.5488 479.5803 485.7176 533.7426 535.5793 550.7561 564.3839 585.6918 636.0281 645.3762 670.6155 695.0055 709.8492 721.1097 745.2143 751.5444 780.4009 830.7591 832.7944 840.7604 857.9274 873.3095 890.1814 907.6547 916.6963 945.9934 948.7401 951.9018 955.7589 963.1557 964.9524 991.2197 1004.4332 1018.6225 1048.8919 1055.6935 1058.9424 1063.7121 1097.7053 1098.5412 1107.8263 1109.0601 1111.5223 1116.9103 1140.5802 1156.2147 1157.4941 1184.6933 1189.6055 1192.0818 1210.3796 1222.6964 1230.2319 1244.7163 1267.1535 1293.3420 1305.1994 1308.7708 1326.1871 1332.5465 1356.8913 1362.7328 1376.3045 1379.2334 1382.4683 1391.6122 1395.8418 1414.6720 1420.0693 1431.2889 1442.8799 1448.8762 1459.1788 1461.1798 1463.4839 1465.0440 1467.2298 1468.0194 1471.4880 1471.9049 1477.7851 1484.1654 1487.2359 1492.8823 1496.8001 1499.4917 1505.7544 1512.4233 1566.8631 1580.4324 1585.2464 1621.4394 1623.6913 2929.9411 2945.0835 2957.6206 2964.9932 2972.6240 2976.1184 2978.4777 2989.4089 3005.7343 3011.7030 3029.6095 3034.7596 3064.8775 3072.0131 3076.0614 3077.6303 3082.2619 3089.6870 3099.7831 3114.8145 3114.8979 3115.6494 3118.7256 3121.9564 3137.0688 3146.8732 3151.9349 3153.6665 3163.8111
redmass: 3.0637 3.9472 3.6673 3.9104 3.6313 3.0200 3.5386 1.9397 3.3264 3.9727 3.8163 2.2006 1.4966 1.7075 2.3532 1.2022 1.3979 2.0039 1.1487 3.1528 3.1964 1.3332 2.8017 2.8660 2.5931 3.5857 3.1329 2.7714 3.3901 3.2507 2.7553 2.8258 3.8931 4.2139 3.2546 3.1987 3.2626 3.2098 3.7169 3.9401 3.4855 3.5064 6.7248 4.5627 4.0236 2.8546 2.8439 5.9353 3.7320 4.1126 1.8978 1.5858 1.8450 1.7197 1.6927 3.6447 2.5681 1.5214 1.1830 2.4215 1.4611 1.4689 1.3237 1.8223 2.2354 4.0005 3.1170 2.4533 1.7857 1.4932 1.4178 2.0678 1.5818 1.3149 1.3180 1.2412 2.5461 1.5272 1.3871 1.6548 1.5617 1.3490 1.3733 1.2039 2.2497 1.8374 2.6457 5.7518 3.0926 1.5960 1.8539 1.3160 1.7632 1.4728 2.5415 1.5751 1.2007 2.5902 3.6332 4.7967 1.2390 1.1820 2.7951 1.1891 1.2744 1.7176 1.1896 1.0428 1.4298 1.0450 1.0626 1.0509 1.0503 1.0470 1.0489 1.1164 1.0511 1.3563 1.2724 1.4881 2.2640 1.2930 4.9948 6.7039 5.8793 6.3404 6.0183 1.0377 1.0386 1.0370 1.0377 1.0349 1.0356 1.0839 1.1004 1.1011 1.0624 1.1011 1.1011 1.0999 1.0991 1.1003 1.0999 1.0997 1.0960 1.0939 1.0961 1.0873 1.0868 1.0876 1.0961 1.0937 1.0944 1.0956 1.0912 1.0953
irintensity: 0.0625 0.1654 0.2755 2.3654 1.4518 0.8909 2.3500 3.3488 0.8158 6.1113 1.1927 0.7295 1.0905 0.8091 0.0340 0.3909 0.0326 0.1084 0.0171 0.6344 0.6154 1.2161 1.5703 7.1495 2.1316 1.4397 2.9993 0.4113 0.3349 7.7581 8.9119 1.2240 0.3263 4.5339 3.8590 1.1544 1.2041 11.3019 0.2581 2.0293 6.4691 29.2377 1.7206 10.0041 2.9136 16.9135 43.9997 26.1382 6.1720 4.0012 32.7533 3.2755 9.7142 35.6733 1.3149 10.5274 2.2811 25.8030 2.9190 17.9690 4.3514 0.1584 0.4035 1.3643 5.6210 19.9958 20.8897 9.6489 44.7980 27.4052 7.8055 7.5476 10.8997 6.5429 1.2959 0.0302 1.7014 13.9986 0.3234 0.7819 3.6467 99.0563 107.5157 55.0037 29.3380 2.1207 82.2874 20.7672 36.9713 8.0888 15.4459 0.9020 6.6793 8.7182 61.5934 75.8666 16.5653 90.8536 75.2114 53.0450 14.6250 59.1267 8.0282 4.0388 61.7168 26.8105 27.1714 0.6320 19.5539 3.0746 17.1545 2.9423 5.4582 20.2748 18.5035 5.3686 28.6757 24.5388 41.1090 22.5083 185.1408 169.5878 294.6137 71.2111 27.4200 52.2316 158.5839 126.8135 66.5451 49.0257 112.4684 34.9532 38.1440 18.5927 44.0076 49.9973 37.4571 59.3166 25.9748 0.8715 113.5681 27.0420 3.5614 37.1410 5.7025 54.5726 11.5122 12.9783 13.4998 24.8874 2.8173 25.1648 23.9912 2.1075 6.1768 28.5361
temp: 298.150 k
press: 1.00000 atm
elementType: 8 7 7 7 6 6 6 6 6 6 6 6 6 6 6 6 6 6 6 6 6 6 6 6 6 1 1 1 1 1 1 1 1 1 1 1 1 1 1 1 1 1 1 1 1 1 1 1 1 1 1 1 1 1
symmnumber: 1
zpe: 1201485.5 jmol-1
zpe.correction: 0.457622 hartree
zpe.thermalcorrener: 0.483687 hartree
zpe.thermalcorrenthalpy: 0.484631 hartree
zpe.thermalcorrgfe: 0.399893 hartree
zpe.sumelectzpe: -1055.236958 hartree
zpe.sumelectthermal: -1055.210893 hartree
zpe.sumelectthermalent: -1055.209948 hartree
zpe.sumelectthermalfe: -1055.294686 hartree
dipole: -2.2803 -0.3691 -1.7363
dipole: 2.8898
quadrupole: -138.7453 -144.3855 -140.5086
quadrupole: -9.4417 -10.5085 -1.7448
quadrupole: 2.4678 -3.1724 0.7045 -9.4417 -10.5085 -1.7448
hfenergy: -1055.6945795 hartree
pointgroup: C01 [X(C21H29N3O1)]
dipole: 0.9295599 -0.3918074 0.5243962 debye
polarizability: 268.2883258|-9.9117345|264.3609976|-23.4468119|23.8289755|236.0104508 unknown
InChI: InChI=1S/C21H29N3O/c1-16(2)18-10-12-19(13-11-18)24(21(25)23(5)6)15-17-8-7-9-20(14-17)22(3)4/h7-14,16H,15H2,1-6H3
charge 0 multiplicity 1
54 atoms
O  -0.741243 3.104222 0.683375
N  0.355074 1.535318 -0.691527
N  1.592997 3.05465 0.693122
N  -4.089703 -0.472877 1.780387
C  3.934266 -3.074137 -0.408269
C  -0.872339 1.41198 -1.543851
C  3.002794 -1.861449 -0.476724
C  1.249071 0.411475 -0.616884
C  -1.831511 0.304271 -1.116438
C  2.517043 -1.381043 -1.717523
C  2.583359 -1.180349 0.696379
C  1.65909 -0.263044 -1.794444
C  1.715949 -0.072706 0.634603
C  3.290046 -4.248116 0.377221
C  5.31594 -2.702978 0.194184
C  0.349538 2.585428 0.265714
C  -2.510767 0.418888 0.116591
C  -3.422184 -0.590629 0.553771
C  -2.051965 -0.819113 -1.950275
C  -3.635348 -1.720747 -0.301126
C  -2.95656 -1.821093 -1.530529
C  1.637826 3.957037 1.853952
C  2.857812 2.873674 -0.03477
C  -5.039013 -1.50663 2.202839
C  -3.856402 0.701928 2.629123
H  4.10489 -3.421856 -1.447544
H  -0.555343 1.253598 -2.590773
H  -1.375122 2.391748 -1.483441
H  2.817929 -1.887513 -2.643366
H  2.922617 -1.530327 1.679166
H  1.314387 0.086061 -2.773533
H  1.384397 0.416559 1.556633
H  3.112824 -3.970087 1.433068
H  3.953623 -5.133055 0.368534
H  2.318407 -4.535951 -0.062414
H  5.800372 -1.895393 -0.383885
H  5.989099 -3.580746 0.19693
H  5.211567 -2.355359 1.239134
H  -2.317073 1.31068 0.720401
H  -1.522468 -0.910657 -2.905882
H  -4.327694 -2.515321 -0.008412
H  -3.136362 -2.695853 -2.166946
H  1.912951 4.98604 1.547552
H  2.383596 3.598646 2.590003
H  0.640382 3.990827 2.316273
H  2.663018 2.538341 -1.064075
H  3.518504 2.128977 0.450849
H  3.390203 3.843455 -0.075923
H  -4.554228 -2.500898 2.296543
H  -5.88593 -1.610784 1.492146
H  -5.455834 -1.24113 3.187563
H  -4.447636 0.608889 3.554369
H  -4.152213 1.644717 2.124859
H  -2.788633 0.798832 2.912273
