program: Gaussian 09
title: 000178225
version: EM64L-G09RevD.01
frameworkgroup: C1[X(C12H3BrCl4O2)]
method: RPBEPBE
basis: SDD
operation: Freq
keyword: #p
keyword: freq=noraman
keyword: PBEPBE/SDD
title: #p freq=noraman PBEPBE/SDD
converged: NO NO NO NO
title: Mulliken charges:
elementType: Br Cl Cl Cl Cl O O C C C C C C C C C C C C H H H
charge: 0.084179 0.052400 0.053109 0.014429 0.013667 -0.251050 -0.267379 0.411695 0.283156 0.275114 0.265064 -0.282023 -0.356390 -0.342993 -0.341390 -0.092819 -0.214201 -0.089538 -0.088924 0.289089 0.293988 0.290817
chargesum: 0.00000
title: Mulliken charges with hydrogens summed into heavy atoms:
elementType: Br Cl Cl Cl Cl O O C C C C C C C C C C C C
charge: 0.084179 0.052400 0.053109 0.014429 0.013667 -0.251050 -0.267379 0.411695 0.283156 0.275114 0.265064 -0.282023 -0.067301 -0.049005 -0.050573 -0.092819 -0.214201 -0.089538 -0.088924
polarizability: 3.55388160e+02 -1.95002478e+00 2.01706107e+02 7.68254275e-04 -2.76465543e-03 6.45425675e+01
1716.lowfreq: -1.4570 -0.5488 -0.0028 -0.0027 -0.0023 8.5187 21.9052 40.7173 71.2709
frequency: 21.8450 40.7165 71.2706 88.9152 113.4584 136.7693 142.5763 159.9048 176.3098 191.7717 198.2022 224.4314 231.7028 284.1779 285.5893 330.1125 353.1374 366.1168 400.8435 416.9081 443.5657 490.0594 520.6917 525.4472 542.6907 576.6868 595.8366 616.5330 632.2143 660.7391 687.3036 699.5839 743.6068 783.1573 847.1986 860.1047 863.1868 873.5939 896.1936 938.5844 1099.4487 1108.0140 1118.0685 1152.2988 1221.7402 1223.8089 1282.4641 1337.1173 1345.7628 1366.5657 1369.1150 1429.2356 1468.5569 1549.4918 1571.5657 1584.6750 1627.6013 3175.1869 3177.2271 3181.8108
redmass: 17.6560 21.2574 31.6968 22.3155 10.0738 10.8484 30.7561 11.3260 34.0413 20.3748 32.0634 23.0474 6.6407 7.7748 21.1548 15.7376 12.2646 12.2944 15.0541 14.7353 3.1122 8.6853 4.6101 8.5593 8.0621 11.6726 12.1567 11.9728 8.7167 4.1316 8.8773 7.6570 7.8900 8.5578 1.4136 1.3969 8.0233 1.3798 9.4980 12.0737 1.7202 6.9717 8.0707 2.0991 2.1296 1.8780 4.4790 10.3394 9.4934 6.8009 8.7931 5.3297 4.0422 11.0658 8.4740 10.7633 8.8066 1.0924 1.0933 1.0928
irintensity: 0.0060 0.0108 0.0025 0.0294 0.0403 0.2586 0.0290 0.5029 0.1766 0.1557 0.0303 0.0830 0.2897 0.5491 0.3956 0.0387 2.0842 3.6869 5.9957 10.2223 9.3763 11.6026 1.7926 0.9673 0.0146 0.0090 0.0268 0.9071 4.8649 0.0879 22.9425 3.5432 6.4214 89.8892 0.0437 19.2132 93.1675 61.9691 116.4157 21.8755 122.6475 34.2757 1.8535 47.5865 0.3973 2.3490 225.8510 22.7609 110.0614 9.1784 83.6443 739.9646 420.4152 45.3769 15.0008 7.9261 8.8472 3.9683 1.5599 2.7672
temp: 298.150 k
press: 1.00000 atm
elementType: 35 17 17 17 17 8 8 6 6 6 6 6 6 6 6 6 6 6 6 1 1 1
symmnumber: 1
zpe: 301587.5 jmol-1
zpe.correction: 0.114869 hartree
zpe.thermalcorrener: 0.131824 hartree
zpe.thermalcorrenthalpy: 0.132768 hartree
zpe.thermalcorrgfe: 0.067443 hartree
zpe.sumelectzpe: -2461.870974 hartree
zpe.sumelectthermal: -2461.854019 hartree
zpe.sumelectthermalent: -2461.853075 hartree
zpe.sumelectthermalfe: -2461.918399 hartree
dipole: 0.0662 -1.2921 0.0001
dipole: 1.2938
quadrupole: -158.6172 -140.5402 -146.3439
quadrupole: -3.5417 -0.0001 -0.0002
quadrupole: -10.1167 7.9602 2.1565 -3.5417 -0.0001 -0.0002
hfenergy: -2461.9858426 hartree
pointgroup: C01 [X(C12H3Br1Cl4O2)]
dipole: 0.0093915 -0.5089463 -0.0000334 debye
dipolederiv: -0.4519465 -0.2812595 -0.0000043 -0.3648461 -0.1954785 0.0000137 -0.000044 -0.0000222 0.0263011 -0.0134191 -0.013147 0.0000026 0.0523297 -0.6157336 -0.0000229 -0.0000092 -0.0000513 0.0129768 -0.5867502 0.2545303 0.0000345 0.3291323 -0.1402964 -0.0000136 0.000066 -0.0000162 0.0085082 -0.6052064 -0.2890406 -0.0000232 -0.4003599 -0.2577863 -0.0000178 0.0000013 0.0000054 -0.01503 -0.6589256 0.2701592 -0.0000182 0.3716486 -0.2143627 0.0000019 -0.0000318 0.0000007 -0.015612 -2.3054119 -0.0489114 0.0000094 -0.0941668 -0.2865541 0.0000006 -0.0000206 0.0000028 -0.1288319 -2.2982797 -0.0212903 0.0000006 -0.0581058 -0.3788268 0.0000027 -0.0000303 -0.0000606 -0.1430366 1.2612618 0.1932832 0.000028 1.1205657 -0.1296134 0.000011 0.0000261 -0.0000316 0.1143331 1.4526417 -0.114273 -0.0000969 -0.9351248 0.2211249 -0.0000749 -0.000124 0.0000156 0.0785242 1.4367869 -0.1322392 -0.0000185 -0.9673078 0.114927 -0.0000463 -0.0000348 -0.0000036 0.0702976 1.3192865 0.1691597 0.0000896 1.0555584 0.166205 0.0000186 0.0001794 0.0000402 0.0732715 -0.2129545 0.0368894 0.0000298 -0.0184402 0.9397356 0.0000241 0.0000286 0.0000858 -0.0641833 -0.527497 -0.0994392 -0.0000023 -0.185139 -0.1107773 0.0001121 -0.0000084 0.0000006 -0.0997253 -0.4165228 -0.0847394 0.0000307 -0.0995048 -0.067878 -0.0000086 0.0000346 0.0000187 -0.0914953 -0.4314309 0.0607363 -0.0000536 0.0752616 -0.0509091 0.000005 -0.0000078 0.0000152 -0.0962969 0.5817363 -0.5644174 -0.0001511 -0.6060139 -0.0825611 0.0000059 -0.0001118 0.0000033 -0.022401 0.6928034 0.5986444 0.0001019 0.667919 0.3755514 -0.000023 0.0000616 0.0000329 -0.1187985 0.6822652 0.5773309 -0.0000122 0.6832536 0.3296003 0.0000276 -0.0000492 -0.0000282 -0.0651888 0.7766074 -0.544945 0.0000595 -0.649019 0.2520684 -0.0000359 0.000077 0.0000041 -0.0647459 0.1019336 0.0270378 -0.0000001 0.0177014 0.0416424 -0.0000324 0.0000082 -0.0000078 0.1790127 0.1012807 0.0271019 -0.0000166 0.0211589 0.0490258 0.0000233 0.0000074 0.0000023 0.1808202 0.1017412 -0.0211711 0.0000103 -0.0165011 0.0408964 0.000029 -0.0000183 -0.0000059 0.1813001 unknown
polarizability: 354.3740294|12.5947557|202.720238|0.0005741|0.0028114|64.5425675 unknown
InChI: InChI=1S/C12H3BrCl4O2/c13-4-1-9-12(11(17)10(4)16)19-8-3-6(15)5(14)2-7(8)18-9/h1-3H
charge 0 multiplicity 1
22 atoms
Br -5.067183 -2.109401 -0.000023
Cl -2.363218 2.955855 0.000023
Cl -5.120183 1.252158 0.000179
Cl 5.237346 1.694124 0.000076
Cl 5.366751 -1.595193 0.000095
O  0.080266 1.304512 -0.000093
O  0.1916 -1.608292 -0.000257
C  -1.085913 0.51043 -0.000073
C  -1.035717 -0.906917 -0.000139
C  1.309322 0.601337 -0.00007
C  1.364469 -0.815576 -0.000098
C  -2.335293 1.161405 -0.000045
C  -2.212433 -1.665506 -0.000129
C  2.489232 1.354839 -0.000008
C  2.600572 -1.473324 -0.000038
C  -3.536698 0.403401 0.000025
C  -3.462816 -1.010652 -0.000031
C  3.738287 0.695953 0.000052
C  3.793786 -0.717792 0.000039
H  -2.143057 -2.755983 -0.000203
H  2.429857 2.446571 -0.000008
H  2.628923 -2.566349 -0.000073
