program: Gaussian 09
title: 000178223
version: EM64L-G09RevD.01
frameworkgroup: C1[X(C12H3Br2Cl3O2)]
method: RPBEPBE
basis: SDD
operation: Freq
keyword: #p
keyword: freq=noraman
keyword: PBEPBE/SDD
title: #p freq=noraman PBEPBE/SDD
converged: NO NO NO NO
title: Mulliken charges:
elementType: Br Br Cl Cl Cl O O C C C C C C C C C C C C H H H
charge: 0.111473 0.088210 0.052850 0.014281 0.013535 -0.250250 -0.266963 0.418034 0.288562 0.275811 0.265405 -0.277150 -0.349381 -0.343179 -0.341422 -0.203467 -0.193824 -0.089386 -0.089076 0.291266 0.293897 0.290777
chargesum: 0.00000
title: Mulliken charges with hydrogens summed into heavy atoms:
elementType: Br Br Cl Cl Cl O O C C C C C C C C C C C C
charge: 0.111473 0.088210 0.052850 0.014281 0.013535 -0.250250 -0.266963 0.418034 0.288562 0.275811 0.265405 -0.277150 -0.058116 -0.049282 -0.050646 -0.203467 -0.193824 -0.089386 -0.089076
polarizability: 3.70524868e+02 2.51338433e+00 2.08522632e+02 3.22788870e-03 -4.54421399e-04 6.74919310e+01
1716.lowfreq: -0.7076 -0.0020 -0.0018 0.0007 2.5043 8.3022 21.0519 37.6023 60.5676
frequency: 21.0083 37.6023 60.5672 86.2792 112.4910 126.1617 136.8323 158.8921 166.6177 174.3093 191.7636 206.1876 230.2632 249.5895 281.7439 327.3638 351.4284 366.1912 384.7801 406.6346 443.6283 476.8387 520.4237 521.5612 539.8175 576.0356 594.9474 602.8449 627.4122 660.4280 682.5561 694.3603 741.0919 781.4504 847.2360 850.2624 861.3102 873.7024 895.5506 932.5897 1099.0106 1104.9723 1115.3352 1145.3589 1219.8952 1222.9862 1279.2296 1330.1591 1341.3333 1364.8242 1366.2542 1424.9267 1468.1366 1545.6519 1568.2942 1583.7109 1626.2744 3174.7921 3177.3855 3181.1172
redmass: 18.6578 22.9562 31.2926 22.3009 10.0348 54.7147 10.9156 11.4271 34.9912 31.9720 21.6372 26.5540 6.5190 27.2613 7.6804 14.4731 12.2696 12.2823 15.7232 14.0204 3.1113 8.5698 8.2501 4.6272 8.0782 11.6787 12.1477 11.5189 9.2952 4.1711 8.8982 7.6851 7.8687 8.7195 1.4141 7.9145 1.3926 1.3800 9.5544 11.9651 1.7451 5.4860 7.9792 2.5154 3.3370 1.3592 4.2195 10.1796 9.4377 7.2705 8.0162 5.3369 4.0265 10.9581 8.3947 10.7419 8.7512 1.0925 1.0932 1.0928
irintensity: 0.0001 0.0001 0.0131 0.0146 0.0200 0.1343 0.3305 0.3455 0.1619 0.1571 0.1365 0.0289 0.5242 0.1365 0.9170 0.2045 2.7609 3.6440 13.3679 1.0161 9.3781 9.9351 0.7551 1.9224 0.0284 0.0059 0.0000 0.0662 5.6459 0.0577 22.2857 1.9654 8.1819 89.8875 0.0074 93.1457 18.7782 62.5459 107.6292 24.6007 129.3513 29.1663 7.6884 33.2962 1.0861 1.6303 243.4700 35.8291 110.9516 13.1673 72.2157 748.0643 446.3342 53.3995 14.1142 8.1899 9.4078 3.5681 2.0217 2.5991
temp: 298.150 k
press: 1.00000 atm
elementType: 35 35 17 17 17 8 8 6 6 6 6 6 6 6 6 6 6 6 6 1 1 1
symmnumber: 1
zpe: 299906.2 jmol-1
zpe.correction: 0.114228 hartree
zpe.thermalcorrener: 0.131456 hartree
zpe.thermalcorrenthalpy: 0.132400 hartree
zpe.thermalcorrgfe: 0.065866 hartree
zpe.sumelectzpe: -2015.270017 hartree
zpe.sumelectthermal: -2015.252789 hartree
zpe.sumelectthermalent: -2015.251845 hartree
zpe.sumelectthermalfe: -2015.318380 hartree
dipole: -0.2570 -1.1850 -0.0001
dipole: 1.2125
quadrupole: -159.0148 -142.3298 -149.1643
quadrupole: 1.1052 0.0007 0.0001
quadrupole: -8.8452 7.8398 1.0053 1.1052 0.0007 0.0001
hfenergy: -2015.3842456 hartree
pointgroup: C01 [X(C12H3Br2Cl3O2)]
dipole: -0.091223 0.4682428 0.0000231 debye
dipolederiv: -0.4726356 -0.2489679 -0.0000244 -0.3062372 -0.0535666 -0.0000102 -0.0000059 0.0000031 0.0492279 -0.4280681 0.2980418 0.0000536 0.3734223 -0.2249095 -0.0000473 0.0000929 -0.0000692 0.0243165 -0.0093984 0.0370046 -0.0000014 -0.0339032 -0.6133956 0.0000578 -0.0000135 0.0000657 0.0090859 -0.6094746 0.2873606 -0.0000093 0.4053387 -0.258214 0.0000049 -0.0000181 0.0000085 -0.0151456 -0.6671574 -0.2714401 0.000003 -0.3736055 -0.2137528 0.0000045 0.0000501 0.0000258 -0.0156937 -2.3432176 0.0412657 0.0000236 0.0966446 -0.2847488 -0.0000205 -0.0000341 -0.0000263 -0.1271083 -2.3463887 0.0018011 0.0000209 0.0544041 -0.3834273 0.0000329 0.0000086 0.000052 -0.1428647 1.2810464 -0.1979099 -0.00004 -1.106905 -0.139583 0.0000565 -0.0000018 0.0000323 0.1105752 1.4879492 0.1215863 -0.000083 0.9447678 0.2402113 -0.0000234 -0.0001574 -0.000026 0.0827008 1.4555165 0.134085 0.0000259 0.9771014 0.1160658 0.0000073 0.0000426 0.0000337 0.0704968 1.3366919 -0.1612603 0.0000511 -1.0760668 0.1611511 -0.0000215 0.0001006 -0.0000222 0.0727654 -0.2631653 -0.0431497 -0.000018 -0.0802498 0.9176673 -0.0001329 0.0000232 -0.0001087 -0.0501523 -0.524868 0.1211223 0.0000443 0.1581001 -0.1243935 -0.0000086 0.000062 -0.0000201 -0.1023671 -0.4221389 0.0840436 0.0000059 0.1001607 -0.0687899 0.0000075 -0.0000006 -0.0000059 -0.0914068 -0.4373535 -0.0626605 0.000011 -0.07405 -0.0506239 -0.0000154 0.0000077 -0.0000014 -0.0962667 0.596251 0.6095172 0.0001 0.6471513 -0.1357542 0.0000333 0.0000639 -0.0000165 -0.0874438 0.5988004 -0.6834337 -0.0001621 -0.644765 0.4048203 0.0000885 -0.0002134 0.0001323 -0.1006234 0.6830509 -0.5760752 0.0000095 -0.6886145 0.3312982 -0.0000082 0.0000537 -0.000003 -0.0651379 0.7857385 0.5455577 -0.0000073 0.6523684 0.2505641 -0.0000101 -0.0000722 -0.0000526 -0.0648306 0.0948764 -0.0305388 0.0000059 -0.0196153 0.0395246 -0.0000089 0.0000325 -0.0000152 0.1780114 0.1015412 -0.0272626 -0.0000003 -0.0219262 0.0489546 0.0000033 -0.0000084 0.0000013 0.1806161 0.1024037 0.0213125 -0.0000089 0.0164791 0.0409018 0.0000107 -0.0000122 0.0000126 0.181245 unknown
polarizability: 370.3461692|-5.935886|208.7013307|-0.0032368|-0.0003861|67.491931 unknown
InChI: InChI=1S/C12H3Br2Cl3O2/c13-4-1-9-12(11(17)10(4)14)19-8-3-6(16)5(15)2-7(8)18-9/h1-3H
charge 0 multiplicity 1
22 atoms
Br -5.248864 -1.302675 -0.000105
Br -5.040471 2.153203 0.000329
Cl -2.348553 -2.946437 0.000253
Cl 5.238035 -1.707818 0.00006
Cl 5.377898 1.581099 0.000017
O  0.081721 -1.301549 -0.000123
O  0.202225 1.609818 -0.000273
C  -1.08263 -0.504355 -0.00009
C  -1.027032 0.912249 -0.000146
C  1.313229 -0.602672 -0.000043
C  1.373013 0.813984 -0.00014
C  -2.335365 -1.151361 0.000032
C  -2.201103 1.674042 -0.000027
C  2.490866 -1.359873 0.000036
C  2.611167 1.467953 -0.000084
C  -3.53748 -0.391431 -0.000048
C  -3.455056 1.024086 0.00002
C  3.742125 -0.704967 0.000046
C  3.802131 0.708716 0.000053
H  -2.127056 2.76422 0.000047
H  2.428001 -2.45142 0.000056
H  2.642801 2.56089 -0.000173
