program: Gaussian 09
title: 000178210
version: EM64L-G09RevD.01
frameworkgroup: C1[X(C7H6ClF3N2OS)]
method: RPBEPBE
basis: SDD
operation: Freq
keyword: #p
keyword: freq=noraman
keyword: PBEPBE/SDD
title: #p freq=noraman PBEPBE/SDD
converged: NO YES NO NO
title: Mulliken charges:
elementType: Cl S F F F O N N C C C C C C C H H H H H H
charge: 0.072182 0.321287 -0.152998 -0.146019 -0.145710 -0.173394 -0.121416 0.063716 -0.123857 0.436310 -0.644432 -0.650417 0.228987 0.292712 -0.813024 0.258393 0.259280 0.270986 0.243543 0.243618 0.280252
chargesum: 0.00000
title: Mulliken charges with hydrogens summed into heavy atoms:
elementType: Cl S F F F O N N C C C C C C C
charge: 0.072182 0.321287 -0.152998 -0.146019 -0.145710 -0.173394 -0.121416 0.063716 -0.123857 0.436310 -0.644432 0.138241 0.228987 0.292712 -0.045610
polarizability: 1.81780199e+02 1.81616101e+01 1.33313441e+02 -1.53893868e-01 1.41329279e-01 6.17725623e+01
1716.lowfreq: -32.8801 -10.6254 -5.0171 -3.3080 -0.0017 -0.0015 0.0019 15.5337 34.5357
frequency: -32.7156 15.3341 34.4178 91.2781 97.9162 100.1610 132.3025 160.7635 205.8213 209.6621 254.9894 267.9736 283.2110 324.4964 340.2083 363.7658 370.1826 383.7022 452.2089 471.3804 518.0554 521.5817 542.0630 593.7220 599.8789 623.9156 659.0737 681.8305 749.2606 813.5930 954.6226 975.3019 1003.5504 1027.1491 1028.1533 1051.7405 1102.5676 1115.9070 1144.1441 1206.0711 1277.6288 1327.1760 1378.8292 1433.3843 1463.2609 1465.4502 1488.5886 1494.6897 1506.8715 1565.0747 1645.8560 2984.6891 2991.8890 3060.2626 3080.5903 3131.3603 3169.1863
redmass: 6.6273 15.9292 3.2594 4.9430 8.4709 11.6615 1.2131 16.1681 3.3612 11.5565 1.3181 8.4619 10.9765 5.5212 8.0304 22.9752 10.3180 3.1800 9.3460 15.7383 5.3600 7.2072 4.4703 5.3820 10.0691 11.7226 8.0022 12.7848 6.1279 9.3703 10.7390 1.8714 12.9823 4.5621 1.6700 3.6669 8.3776 1.2954 2.9424 8.9573 3.8785 10.7453 1.2203 1.1359 1.1003 1.0460 1.0660 1.0420 10.3243 9.7929 9.6319 1.0397 1.0382 1.1026 1.0988 1.0980 1.0933
irintensity: 3.5547 0.0658 1.8362 0.5647 0.8322 0.0473 0.0062 1.3732 1.7258 1.2280 0.0903 1.7708 1.0254 0.3724 1.0160 2.6392 1.8028 3.3983 7.0145 5.2884 37.0276 4.3796 0.5029 1.8827 5.7957 16.2654 16.3452 3.7040 11.3725 63.2181 43.1771 82.1883 247.0616 350.4124 7.9290 4.8567 178.2282 0.5434 88.0719 83.9999 341.1732 148.7616 48.6894 37.7298 14.1610 37.2076 28.3615 0.0934 95.0757 291.9743 205.8667 21.0641 5.6462 14.6045 10.5704 6.0065 7.3958
temp: 298.150 k
press: 1.00000 atm
elementType: 17 16 9 9 9 8 7 7 6 6 6 6 6 6 6 1 1 1 1 1 1
symmnumber: 1
zpe: 334576.0 jmol-1
zpe.correction: 0.127433 hartree
zpe.thermalcorrener: 0.142206 hartree
zpe.thermalcorrenthalpy: 0.143151 hartree
zpe.thermalcorrgfe: 0.083391 hartree
zpe.sumelectzpe: -1611.567223 hartree
zpe.sumelectthermal: -1611.552450 hartree
zpe.sumelectthermalent: -1611.551506 hartree
zpe.sumelectthermalfe: -1611.611265 hartree
dipole: -5.9739 6.1878 0.0618
dipole: 8.6011
quadrupole: -80.4822 -107.5471 -100.1088
quadrupole: -5.5952 -0.2294 -0.0936
quadrupole: 15.5638 -11.5010 -4.0628 -5.5952 -0.2294 -0.0936
hfenergy: -1611.6946566 hartree
pointgroup: C01 [X(C7H6Cl1F3N2O1S1)]
dipole: 2.56409 2.2082272 -0.0153378 debye
dipolederiv: -0.5536047 0.3095186 0.0038004 0.4111875 -0.2410911 -0.0033941 0.0038101 -0.0024782 0.0625016 -0.1725409 -0.0176873 -0.0001874 0.2596922 -0.5348925 -0.0061737 0.0004463 -0.0059355 0.1249293 -0.7846531 0.0735867 0.0013167 0.0427235 -0.3834485 -0.0011655 0.0008871 -0.0010717 -0.2797032 -0.3657594 -0.1249724 -0.0033907 -0.156918 -0.6062971 -0.2662592 -0.023658 -0.2619839 -0.631416 -0.3655658 -0.1246151 0.0006922 -0.1566433 -0.6157372 0.2662626 0.0200701 0.2617364 -0.6207411 -0.391682 -0.206658 0.0070123 0.3630139 -1.0353914 0.007899 -0.0000206 0.0121069 -0.2749598 -1.7906234 0.6241324 0.0048878 0.8502256 -1.1598604 0.0022729 0.0037013 0.0008604 -0.1973018 -0.8435221 -0.0897032 0.0011095 -0.4358431 -0.5357829 -0.0045395 -0.001664 -0.0048501 -0.1275159 1.6627064 -0.4326666 -0.0033306 -0.0833374 0.751356 0.0099924 -0.00679 0.0134336 0.040371 -0.0076754 -0.1442614 -0.0023093 -0.1185462 -0.2270123 -0.00101 0.000346 -0.0028551 -0.0707892 0.8162703 -0.2757157 -0.0039699 -0.3382832 0.589545 0.0070481 -0.0033449 0.0065454 -0.1858427 0.0910241 0.1179314 -0.0014962 0.2383405 0.2864951 -0.0037227 0.0011512 -0.0045217 0.2123521 1.2313429 -0.290844 -0.0129194 -1.194071 1.8356293 -0.0126058 -0.0072991 -0.0152607 0.1723175 1.6516235 0.4242953 0.0039743 0.3383108 1.7392702 0.0020276 0.0029889 0.0016033 1.5792363 -0.4730241 0.0741736 0.0055836 0.003447 -0.0360787 0.0006826 0.0048317 0.0004949 0.053744 0.1044591 0.0526195 0.065568 -0.0444108 -0.0242218 -0.0555189 0.0543787 -0.0801894 -0.0334953 0.1035909 0.0488766 -0.064438 -0.0484018 -0.0218492 0.0563039 -0.0506001 0.0806838 -0.0363792 -0.0789363 -0.006695 -0.000772 0.0722232 0.1374827 0.001326 -0.0001477 0.0012856 0.1223016 0.0403533 -0.0131902 -0.0218512 -0.0467893 0.0649306 -0.0997694 -0.054612 -0.0856964 -0.0198477 0.0418262 -0.0111539 0.0199179 -0.04348 0.0640623 0.1016662 0.053711 0.0864503 -0.0220659 0.0843905 0.0130288 0.000802 0.0875599 -0.0471083 -0.0013227 0.0018142 -0.0003579 0.1323044 unknown
polarizability: 178.045619|-22.2889721|137.0464052|-0.4180032|0.3038188|61.7741785 unknown
InChI: InChI=1S/C7H6ClF3N2OS/c1-3(14)13(2)6-12-4(5(8)15-6)7(9,10)11/h1-2H3
charge 0 multiplicity 1
21 atoms
Cl -2.900457 2.494417 0.025527
S  0.164756 2.293949 0.01901
F  -3.692049 -0.386895 -0.000778
F  -2.320256 -1.778628 -1.147791
F  -2.317826 -1.800165 1.116699
O  2.299889 -1.921847 0.025458
N  2.297691 0.438415 -0.002542
N  -0.002035 -0.393659 -0.006169
C  0.903414 0.557018 0.001599
C  -1.311558 0.09312 0.001213
C  -1.446419 1.472917 0.014404
C  3.061138 1.709528 -0.011313
C  2.950224 -0.854329 0.00355
C  -2.39673 -0.946002 -0.007363
C  4.477492 -0.840936 -0.019702
H  2.820271 2.311745 0.884373
H  2.824006 2.298497 -0.916618
H  4.137277 1.507423 -0.006363
H  4.906692 -0.349861 0.872398
H  4.880688 -0.345624 -0.921332
H  4.801392 -1.891783 -0.025959
