program: Gaussian 09
title: 000178208
version: EM64L-G09RevD.01
frameworkgroup: C1[X(C10H7F3N2S)]
method: RPBEPBE
basis: SDD
operation: Freq
keyword: #p
keyword: freq=noraman
keyword: PBEPBE/SDD
title: #p freq=noraman PBEPBE/SDD
converged: NO NO NO NO
title: Mulliken charges:
elementType: S F F F N N C C C C C C C C C C H H H H H H H
charge: 0.259887 -0.164429 -0.152616 -0.152640 -0.373218 -0.053416 0.465839 -0.206851 0.338328 -0.453035 -0.331893 -0.638725 0.282390 -0.196917 -0.222533 -0.251826 0.320597 0.301481 0.220680 0.315888 0.229655 0.231183 0.232173
chargesum: 0.00000
title: Mulliken charges with hydrogens summed into heavy atoms:
elementType: S F F F N N C C C C C C C C C C
charge: 0.259887 -0.164429 -0.152616 -0.152640 -0.052621 -0.053416 0.465839 -0.206851 0.338328 -0.232356 -0.016005 -0.337244 0.282390 0.032739 0.008650 -0.019654
polarizability: 2.24123156e+02 -2.40380858e+01 1.56266609e+02 1.23211819e-02 5.86257186e-03 5.88726715e+01
1716.lowfreq: -5.3292 -4.4656 -0.0012 -0.0010 0.0019 5.0588 27.0806 44.2260 60.3501
frequency: 26.9388 44.2163 60.3476 66.6799 116.3909 171.1457 207.1155 256.5788 262.4009 262.9905 321.5885 324.5261 386.4488 409.4623 460.0390 493.0540 513.9293 525.0857 557.6414 569.7144 578.6429 614.4302 634.3503 675.8583 698.2272 742.2381 762.3986 765.5816 804.0247 816.4162 841.5265 883.2752 918.4962 973.7643 984.8519 997.7897 1005.0518 1015.8565 1027.3707 1032.6028 1090.8188 1141.8699 1174.0101 1184.9542 1192.9393 1250.8654 1326.8869 1358.4048 1384.2778 1436.4395 1483.2401 1518.7300 1524.4311 1596.4293 1607.1804 1615.5209 3109.6591 3136.5918 3148.4159 3168.7502 3190.7123 3261.8045 3546.8307
redmass: 12.3076 4.3503 6.7900 8.6451 12.1619 7.8607 5.4330 11.0508 3.9180 7.3795 14.2519 10.6948 10.5346 2.9287 9.0844 2.5251 13.7849 11.2103 6.4792 1.4756 7.7685 6.8342 14.0787 4.5927 2.0734 7.5136 1.4483 1.6064 6.4388 6.0041 1.2693 9.9148 1.4065 1.3515 6.1463 9.1035 1.3597 4.9670 2.7488 2.9294 1.5872 2.7838 1.0534 2.4217 1.1179 2.5330 1.4172 8.3713 6.6358 2.3037 2.3346 1.8114 6.0540 6.7293 5.6235 6.3835 1.0891 1.0868 1.0933 1.0995 1.0956 1.0969 1.0763
irintensity: 0.0303 0.0016 0.3645 0.9374 0.1344 0.1970 0.0004 4.9455 7.9076 0.0525 4.7962 0.0014 1.7684 0.0115 1.1918 54.6307 0.3646 16.2123 7.1718 35.4849 3.9351 3.4508 18.3591 0.9875 39.7637 17.2777 11.7103 148.1064 25.1346 3.5379 0.1277 78.5475 9.6635 0.0762 0.0540 224.7308 23.1502 175.7126 85.0592 22.6864 26.1208 17.6899 1.7317 199.7772 3.3736 58.6012 18.6021 38.6016 23.1911 40.5967 69.9878 45.9021 69.9068 504.7628 343.8261 16.9248 14.1244 0.1443 26.1541 21.8684 11.3061 17.4775 41.8172
temp: 298.150 k
press: 1.00000 atm
elementType: 16 9 9 9 7 7 6 6 6 6 6 6 6 6 6 6 1 1 1 1 1 1 1
symmnumber: 1
zpe: 402297.0 jmol-1
zpe.correction: 0.153227 hartree
zpe.thermalcorrener: 0.167083 hartree
zpe.thermalcorrenthalpy: 0.168028 hartree
zpe.thermalcorrgfe: 0.110554 hartree
zpe.sumelectzpe: -1191.210262 hartree
zpe.sumelectthermal: -1191.196405 hartree
zpe.sumelectthermalent: -1191.195461 hartree
zpe.sumelectthermalfe: -1191.252935 hartree
dipole: 3.2933 4.1368 -0.0005
dipole: 5.2876
quadrupole: -90.9128 -90.2439 -104.7459
quadrupole: -5.1613 0.0048 0.0041
quadrupole: 4.3880 5.0569 -9.4450 -5.1613 0.0048 0.0041
hfenergy: -1191.3634884 hartree
pointgroup: C01 [X(C10H7F3N2S1)]
dipole: -1.3233027 1.6051672 0.0018834 debye
dipolederiv: -0.2959194 0.0579148 0.0000877 -0.4175755 -0.505334 -0.0004603 -0.00008 -0.0003407 0.1080056 -0.8896238 -0.0570142 -0.0003944 0.0292283 -0.3709842 -0.0001978 -0.0002312 -0.0002403 -0.2872306 -0.3641767 0.0615378 0.0380522 0.1703973 -0.6339473 0.2708858 -0.0053977 0.2594331 -0.630819 -0.3642065 0.0619833 -0.0375672 0.170704 -0.632372 -0.2708347 0.0062728 -0.2596014 -0.632638 -2.0960459 -0.5174183 -0.0000278 -0.3648019 -0.3985033 -0.0000377 -0.0001837 -0.0000437 -0.2957358 -1.0326463 -0.0857346 0.0000095 0.6832694 -0.5922289 -0.0004661 0.0009231 -0.0004311 -0.1789904 0.9752462 0.4551586 0.0001701 0.9851824 0.5133876 0.0001339 0.0006098 0.0001957 0.1014377 2.2238186 0.4796282 -0.0000386 -0.3516749 0.6695018 0.0005516 -0.0005599 0.0004939 0.064264 0.4363536 0.2588462 0.0002349 0.2144852 -0.204936 -0.0000718 0.0000586 0.0000083 -0.0986197 -0.3366207 -0.188426 -0.0000944 -0.0868997 0.0157485 0.0001664 -0.0000377 0.0001668 -0.2120977 -0.1311247 -0.0117607 0.0000202 -0.2987896 -0.2281815 -0.0000189 -0.0001627 -0.0000425 -0.1560942 -0.2986944 -0.2980463 -0.000123 -0.2677377 0.2162871 0.0004115 -0.0003969 0.0002976 -0.2847726 1.6935052 -0.2841928 -0.0003553 -0.4915507 1.7716853 0.0002978 -0.0007221 0.0004769 1.5848199 0.1694859 0.0120203 -0.0000145 -0.0513096 0.0728338 0.0001371 -0.0000453 0.0001392 -0.1366929 0.0420412 -0.0580057 -0.0000445 0.0546501 0.188676 0.0001941 0.0000354 0.0002254 -0.1376106 -0.1140086 0.079721 0.0000526 0.0234118 -0.0872744 0.0000671 0.0000028 0.0000596 -0.1810415 0.1677044 -0.0190335 -0.0000048 -0.0815849 0.1335886 -0.0001122 -0.000153 -0.000134 0.3153604 0.0903556 0.0093269 -0.0000043 0.0137631 0.1186059 -0.0000906 0.0000383 -0.0000822 0.2356249 0.0931638 -0.0152418 -0.0000079 0.0188846 -0.1338123 -0.0001974 0.0000178 -0.0001937 0.170888 0.1182039 0.068221 0.0000192 0.0847454 0.1279478 -0.0000342 0.0000043 -0.0000508 0.170828 -0.1163419 0.0567067 0.0000547 0.0732488 0.0631665 -0.0000657 0.0000645 -0.0000685 0.1585721 0.0757865 0.0409628 0.0000302 0.0019238 -0.1057441 -0.0001587 0.0000056 -0.0001618 0.1531508 -0.046256 -0.1071538 -0.0000546 -0.1119696 0.0018894 -0.0000992 -0.0000627 -0.000106 0.169392 unknown
polarizability: 223.2824258|25.1827729|157.1072828|-0.0004164|0.0741244|58.8727283 unknown
InChI: InChI=1S/C10H7F3N2S/c11-10(12,13)8-6-16-9(15-8)14-7-4-2-1-3-5-7/h1-6,14H
charge 0 multiplicity 1
23 atoms
S  1.319528 2.763073 0.002097
F  4.508606 -0.503784 -0.000301
F  2.952187 -1.717179 1.127715
F  2.953378 -1.713544 -1.133794
N  -1.155525 1.450701 0.001343
N  0.861599 0.105751 -0.000223
C  -2.191748 0.468324 0.000807
C  0.204352 1.257502 0.00109
C  2.243747 0.311648 -0.000108
C  -3.529621 0.948437 0.0012
C  -1.936925 -0.927492 -0.000098
C  2.700077 1.614215 0.001336
C  3.14228 -0.884153 -0.001581
C  -4.605415 0.039404 0.000675
C  -3.028304 -1.822821 -0.000605
C  -4.361417 -1.354384 -0.000235
H  -1.476239 2.420542 0.001985
H  3.723755 1.977287 0.001741
H  -3.726627 2.028683 0.001909
H  -0.907095 -1.288476 -0.000313
H  -5.632567 0.419676 0.00098
H  -2.827928 -2.899855 -0.001285
H  -5.1974 -2.061254 -0.000635
