program: Gaussian 09
title: 000178229
version: EM64L-G09RevD.01
frameworkgroup: C1[X(C18H15NO2)]
method: RPBEPBE
basis: SDD
operation: Freq
keyword: #p
keyword: freq=noraman
keyword: PBEPBE/SDD
title: #p freq=noraman PBEPBE/SDD
converged: YES YES NO NO
title: Mulliken charges:
elementType: O O N C C C C C C C C C C C C C C C C C C H H H H H H H H H H H H H H H
charge: -0.194576 -0.204496 -0.021225 0.122409 -0.521264 -0.433336 0.290040 -0.420635 -0.535568 0.085309 0.518003 -0.388078 0.087338 -0.501028 0.220673 -0.807646 0.469305 -0.354326 -0.448951 -0.246705 -0.242207 0.241609 0.261478 0.216695 0.202597 0.211348 0.212960 0.229906 0.223307 0.239025 0.247418 0.250681 0.271887 0.249614 0.234107 0.234331
chargesum: 0.00000
title: Mulliken charges with hydrogens summed into heavy atoms:
elementType: O O N C C C C C C C C C C C C C C C C C C
charge: -0.194576 -0.204496 -0.021225 0.122409 -0.018177 -0.014044 0.290040 0.003674 -0.082355 0.085309 0.518003 -0.149053 0.087338 -0.253610 0.220673 -0.556965 0.469305 -0.082439 -0.199337 -0.012598 -0.007877
polarizability: 3.56710719e+02 1.57391114e+01 2.35034425e+02 9.00721291e+00 2.41391432e+00 1.05922616e+02
1716.lowfreq: -4.5608 -0.0004 -0.0003 0.0004 5.4066 7.9497 32.6151 69.4001 90.9109
frequency: 32.3622 69.3682 90.8906 106.0126 125.3007 135.4559 177.9776 197.7642 220.7090 244.5480 274.7138 304.4258 320.3215 344.4621 361.9006 377.6787 429.3344 446.5610 458.3272 474.7941 502.6806 524.4862 540.0706 570.5669 591.8906 614.6701 625.6525 644.9059 685.8428 704.3700 746.7684 759.8810 764.0550 773.5978 796.5195 817.1777 843.6094 859.4585 867.7215 879.0037 904.7631 922.4035 934.0418 941.5306 970.2183 979.6981 981.5036 994.5401 999.9807 1032.7722 1082.3297 1095.2700 1104.2961 1137.6854 1141.3358 1164.7568 1180.5002 1191.2096 1201.5644 1207.2215 1208.6796 1253.9881 1256.8708 1278.4733 1282.4472 1295.0948 1314.1741 1335.2787 1344.7435 1352.9047 1358.0270 1371.8075 1379.4162 1405.0273 1421.0376 1430.1714 1444.0800 1453.5989 1464.9143 1471.3541 1475.2225 1484.2805 1535.6013 1554.6582 1592.1267 1619.9388 1633.2159 2954.2214 2972.3891 2979.8074 2983.3365 3009.4967 3033.0802 3046.3823 3053.1718 3117.4673 3122.6609 3127.5083 3141.2115 3144.2561 3161.4398 3178.0077
redmass: 5.5347 3.4063 4.5785 7.0736 2.7218 4.1554 6.0175 7.5530 4.0087 4.5546 4.9792 3.0689 2.1336 5.1758 6.3708 3.6431 4.1540 3.4689 4.4891 3.3507 4.0038 3.6029 4.5232 3.7089 3.0215 3.6812 6.1237 5.4814 6.4526 9.4160 3.2540 1.4693 3.1555 4.9989 2.2611 1.6982 1.6027 5.2573 1.5211 2.9160 1.5659 2.6366 1.7217 5.1900 1.3726 2.3578 1.9232 1.3506 3.0324 2.2455 1.9292 2.5017 1.7608 1.1682 1.7797 1.5212 1.1649 1.5516 1.6582 2.4684 2.4450 1.4859 1.4965 1.5988 2.1162 2.4008 2.3611 1.5316 1.4704 4.8693 1.7281 2.1088 4.2514 2.8138 2.9464 5.9098 1.4470 1.1364 1.6761 1.1019 1.1103 2.7431 6.1635 7.3687 5.7147 6.6986 6.3264 1.0628 1.0634 1.0646 1.0636 1.0930 1.0959 1.0980 1.1039 1.0865 1.0913 1.0869 1.0902 1.0983 1.0966 1.0971
irintensity: 1.7404 0.3716 0.7266 2.8195 1.0836 0.4795 1.0461 2.2007 3.3645 2.6624 0.9906 2.7686 2.7365 0.7395 0.0570 0.0564 0.2595 4.0336 2.2716 2.4347 8.1134 2.0508 0.5936 7.8005 2.1616 2.0624 2.7757 6.2661 0.9513 10.4215 0.3304 51.6384 20.9069 5.0739 22.1349 0.3486 12.0137 0.9479 9.8637 2.5786 3.4314 0.6302 38.9190 0.4865 3.8673 2.2356 3.9451 0.6904 3.0394 7.9086 0.3172 0.9711 0.6193 3.0528 1.3802 5.9873 9.7102 18.3687 14.1763 83.9847 123.6857 5.4569 7.7636 1.3096 4.6773 19.5663 15.3194 6.1661 2.5026 83.4669 0.0770 9.1845 13.5333 9.8244 16.2005 0.9994 12.2260 10.1797 29.4084 10.8771 6.2076 0.5801 2.4850 7.2181 0.6405 42.0686 3.4982 23.8247 11.2783 37.6880 28.3656 38.5728 7.1672 70.4138 50.9418 6.3264 4.2997 2.2338 11.5185 32.3787 25.9094 15.5542
temp: 298.150 k
press: 1.00000 atm
elementType: 8 8 7 6 6 6 6 6 6 6 6 6 6 6 6 6 6 6 6 6 6 1 1 1 1 1 1 1 1 1 1 1 1 1 1 1
symmnumber: 1
zpe: 744765.3 jmol-1
zpe.correction: 0.283666 hartree
zpe.thermalcorrener: 0.299781 hartree
zpe.thermalcorrenthalpy: 0.300725 hartree
zpe.thermalcorrgfe: 0.240348 hartree
zpe.sumelectzpe: -898.593264 hartree
zpe.sumelectthermal: -898.577150 hartree
zpe.sumelectthermalent: -898.576205 hartree
zpe.sumelectthermalfe: -898.636582 hartree
dipole: 0.4658 4.3799 -0.7400
dipole: 4.4664
quadrupole: -95.9268 -120.0011 -129.6287
quadrupole: -1.5045 -1.2521 1.5181
quadrupole: 19.2588 -4.8156 -14.4432 -1.5045 -1.2521 1.5181
hfenergy: -898.87693 hartree
pointgroup: C01 [X(C18H15N1O2)]
dipole: 0.2030653 -1.7102196 0.3488147 debye
polarizability: 356.7569932|-14.9555703|234.76235|-11.4216545|-2.0031438|106.1484158 unknown
InChI: InChI=1S/C18H15NO2/c20-19(21)18-16-8-4-2-6-13(16)11-14-10-9-12-5-1-3-7-15(12)17(14)18/h2,4,6,8-11H,1,3,5,7H2
charge 0 multiplicity 1
36 atoms
O  0.157513 2.362779 -1.549385
O  -0.799615 2.994861 0.421681
N  -0.404909 2.089367 -0.417509
C  1.834265 0.040066 -0.038381
C  2.332222 1.474518 0.134454
C  3.788179 1.571911 0.634473
C  2.771504 -1.010086 -0.0928
C  4.700886 0.690211 -0.237503
C  4.281532 -0.78189 -0.072356
C  0.406789 -0.281376 -0.087586
C  0.00152 -1.688401 -0.05133
C  2.343213 -2.38317 -0.136057
C  -0.667769 0.665037 -0.112977
C  1.003735 -2.718302 -0.086787
C  -2.053393 0.321077 0.011081
C  -1.36189 -2.050067 0.023195
C  -2.397402 -1.092245 0.080418
C  -3.13243 1.277847 0.017052
C  -3.779198 -1.487462 0.170992
C  -4.457182 0.857487 0.101596
C  -4.791815 -0.536394 0.184466
H  1.672641 2.01852 0.836262
H  2.251181 2.013167 -0.830595
H  4.10895 2.629566 0.600761
H  3.856542 1.243501 1.691301
H  4.598556 0.998472 -1.29684
H  5.764598 0.814089 0.038237
H  4.744153 -1.410159 -0.859521
H  4.676242 -1.169286 0.891064
H  3.109167 -3.167061 -0.177731
H  0.681786 -3.765618 -0.07048
H  -1.621317 -3.115915 0.041699
H  -2.909491 2.346597 -0.019874
H  -4.013201 -2.557078 0.224304
H  -5.258785 1.603911 0.111781
H  -5.841578 -0.839977 0.254093
