program: Gaussian 09
title: 000178204
version: EM64L-G09RevD.01
frameworkgroup: C1[X(C7H7F3N2S)]
method: RPBEPBE
basis: SDD
operation: Freq
keyword: #p
keyword: freq=noraman
keyword: PBEPBE/SDD
title: #p freq=noraman PBEPBE/SDD
converged: YES YES NO NO
title: Mulliken charges:
elementType: S F F F N N C C C C C C C H H H H H H H
charge: 0.260777 -0.166800 -0.155103 -0.155831 -0.303173 -0.045252 0.307400 -0.162401 -0.440606 -0.634196 0.300634 -0.047692 -0.563049 0.317620 0.273481 0.226718 0.298585 0.243753 0.225435 0.219698
chargesum: 0.00000
title: Mulliken charges with hydrogens summed into heavy atoms:
elementType: S F F F N N C C C C C C C
charge: 0.260777 -0.166800 -0.155103 -0.155831 0.014448 -0.045252 0.307400 -0.162401 0.059593 -0.335610 0.300634 0.196061 -0.117915
polarizability: 1.63086127e+02 1.49777934e+01 1.04875673e+02 -6.25229627e+00 -4.43995441e+00 6.26388293e+01
1716.lowfreq: -5.4214 -4.0590 -0.0013 -0.0005 0.0013 1.7354 19.3127 34.7023 57.7136
frequency: 19.0843 34.6650 57.7035 86.1181 110.0117 120.5298 204.6982 221.8387 294.4182 310.2544 323.0367 330.6346 372.0282 432.6186 460.6207 480.7935 506.6049 545.6684 570.7617 628.8539 657.6585 675.3433 710.1315 755.0895 782.2247 871.4905 902.5373 959.5718 978.0238 997.0540 999.2403 1009.4077 1029.0976 1056.8714 1141.2937 1175.1236 1199.6545 1245.7625 1282.7146 1335.0539 1363.5259 1428.2982 1471.3440 1473.0612 1524.2631 1608.6080 1657.8830 2991.8852 3066.6684 3090.2558 3111.8866 3202.2628 3259.9308 3577.4217
redmass: 3.6356 9.0775 5.0185 2.6325 10.9672 4.7324 6.2654 5.8024 5.0176 9.8495 8.9619 3.3765 5.9518 1.9821 4.5743 1.9497 9.4052 5.8788 4.8129 7.8587 1.9774 5.2497 5.5001 1.4039 5.6070 7.0323 1.5943 1.3374 1.9538 12.5387 4.5986 1.2325 7.0330 2.9201 1.9581 1.8015 3.8027 1.2037 1.2334 1.2540 9.3538 1.1916 1.0849 1.4352 8.8877 9.8187 4.5945 1.0634 1.0985 1.0605 1.0952 1.1142 1.0968 1.0779
irintensity: 0.1515 0.1296 1.0076 0.4368 0.5485 0.4248 0.4802 3.1523 6.0426 4.1751 0.3091 0.6034 0.6676 43.7877 7.2277 95.6107 6.5595 6.7560 0.7301 17.4297 21.9205 0.0943 3.7329 68.2202 38.4681 82.0811 10.9598 81.8530 8.9043 239.3943 41.3633 15.4283 165.1611 121.3996 9.1467 49.7879 216.8317 63.4464 0.8006 9.3472 48.8155 24.1739 24.3683 50.0032 18.4906 609.0676 25.7790 41.1581 3.2961 10.5824 8.8468 22.1298 12.5928 68.2087
temp: 298.150 k
press: 1.00000 atm
elementType: 16 9 9 9 7 7 6 6 6 6 6 6 6 1 1 1 1 1 1 1
symmnumber: 1
zpe: 351113.4 jmol-1
zpe.correction: 0.133732 hartree
zpe.thermalcorrener: 0.146896 hartree
zpe.thermalcorrenthalpy: 0.147840 hartree
zpe.thermalcorrgfe: 0.091402 hartree
zpe.sumelectzpe: -1077.030970 hartree
zpe.sumelectthermal: -1077.017806 hartree
zpe.sumelectthermalent: -1077.016862 hartree
zpe.sumelectthermalfe: -1077.073300 hartree
dipole: -4.9801 3.0122 0.1100
dipole: 5.8212
quadrupole: -74.2047 -82.9689 -82.8840
quadrupole: 5.5136 -1.8497 -0.1581
quadrupole: 5.8145 -2.9497 -2.8648 5.5136 -1.8497 -0.1581
hfenergy: -1077.1647019 hartree
pointgroup: C01 [X(C7H7F3N2S1)]
dipole: 1.9471475 -1.1442039 0.380238 debye
dipolederiv: -0.2630533 0.0918664 -0.0605355 -0.2833668 -0.4901909 0.0152005 -0.0416711 0.0613571 0.0904739 -0.8276645 -0.1352367 -0.0716895 -0.0816469 -0.4183826 -0.0031277 -0.0821587 -0.0099104 -0.3000822 -0.418331 0.1682679 0.0411574 0.2425405 -0.673465 -0.2398761 0.0630138 -0.2483672 -0.5763828 -0.3996396 0.0763394 0.0191702 0.1450708 -0.5793797 0.2930046 -0.0212602 0.2905099 -0.6890842 -1.7356651 -0.4057171 -0.1017994 -0.4376522 -0.3969577 -0.0424887 -0.0273302 -0.0366305 -0.4712363 -1.1651333 -0.1455043 -0.1218181 0.5406734 -0.6033805 0.1063379 -0.1866964 0.0110176 -0.2334617 0.3290023 0.3846578 0.0358873 0.3564402 -0.0806406 0.0600345 0.0400539 0.0594488 -0.0944877 2.0503239 0.4515274 0.2420412 -0.0250317 0.7670043 -0.0575224 0.3550941 0.0318529 0.1113753 0.3195017 0.1921527 0.030681 0.6564783 0.5186479 0.0495363 -0.1043757 0.0016523 0.2745432 -0.0985886 -0.293402 0.0707454 -0.3938877 0.0469542 -0.0879631 0.0629736 -0.0775289 -0.2791595 1.7702312 -0.3407057 0.0453086 -0.4061652 1.7529786 -0.0693518 0.0633352 -0.0748348 1.5988438 0.2100777 0.0439022 -0.0121779 -0.0892208 -0.2709966 0.007326 -0.0916887 0.0196331 0.1211694 -0.2139149 0.0047238 -0.02423 0.0383077 -0.3667891 0.0849634 0.0031401 0.0908972 0.0933371 0.2337361 -0.0236698 -0.018301 -0.0978859 0.0840198 0.0059944 -0.0427332 -0.0074177 0.3378827 0.0556974 0.0940433 -0.0076274 -0.0164701 0.0553567 0.0187069 0.0282142 0.0492244 0.0936915 -0.0203196 -0.0858938 -0.0852153 -0.145333 0.0155761 -0.033663 -0.0435676 -0.0635515 -0.1183206 0.0774554 -0.0059769 -0.0273619 0.0024953 0.1158398 0.0094366 -0.0314031 0.008049 0.2343719 0.0462132 -0.0192335 -0.0426596 0.0279772 0.1594582 -0.0554335 0.0036774 -0.0383181 -0.0952946 -0.0487929 -0.0382008 0.091113 -0.0059298 0.1890025 -0.0108559 0.0987203 -0.0125185 0.0033981 0.098864 -0.0139403 -0.0026886 -0.0273935 0.1753445 -0.050259 -0.0453379 -0.0545649 -0.1015774 unknown
polarizability: 161.8908157|16.4545796|105.376826|10.3254933|-1.8940632|63.3329877 unknown
InChI: InChI=1S/C7H7F3N2S/c1-2-3-11-6-12-5(4-13-6)7(8,9)10/h2,4,11H,1,3H2
charge 0 multiplicity 1
20 atoms
S  -0.051412 -2.540223 0.299514
F  -3.771508 -0.0142 -0.529389
F  -2.67983 1.584379 0.66093
F  -2.310623 1.387082 -1.561293
N  2.074127 -0.699792 0.515432
N  -0.125927 0.144484 0.072965
C  -1.423171 -0.344085 -0.109741
C  0.731124 -0.842278 0.298023
C  2.742791 0.623396 0.523588
C  -1.612786 -1.709493 -0.033322
C  -2.520292 0.63565 -0.378534
C  3.911228 0.653559 -0.440511
C  5.187633 0.933626 -0.077669
H  2.650976 -1.527776 0.661793
H  1.972227 1.360744 0.237142
H  3.082071 0.86791 1.548869
H  -2.530854 -2.279497 -0.14466
H  3.666866 0.439766 -1.490838
H  5.999102 0.967114 -0.812519
H  5.454755 1.151935 0.964319
