program: Gaussian 09
title: 000178297
version: EM64L-G09RevD.01
frameworkgroup: C1[X(C23H26O7)]
method: RPBEPBE
basis: SDD
operation: Freq
keyword: #pfreq=noraman
keyword: PBEPBE/SDD
title: #p freq=noraman PBEPBE/SDD
converged: NO YES NO NO
title: Mulliken charges:
elementType: O O O O O O O C C C C C C C C C C C C C C C C C C C C C C C H H H H H H H H H H H H H H H H H H H H H H H H H H
charge: -0.233005 -0.257384 -0.223129 -0.263067 -0.206588 -0.246965 -0.248155 0.333051 -0.213622 -0.194991 -0.592083 -0.206062 -0.002352 -0.087558 -0.454578 -0.137998 0.076913 0.279654 -0.447286 -0.783506 -0.527223 0.365549 -0.351052 -0.401508 -0.320562 0.313350 0.285107 -0.173586 -0.759709 -0.758295 0.244529 0.276397 0.251650 0.241656 0.304854 0.273096 0.250186 0.196267 0.229385 0.210009 0.218942 0.248543 0.232208 0.238460 0.227133 0.221896 0.272543 0.256511 0.283229 0.261197 0.249993 0.257139 0.245292 0.245717 0.254721 0.245085
chargesum: 0.00000
title: Mulliken charges with hydrogens summed into heavy atoms:
elementType: O O O O O O O C C C C C C C C C C C C C C C C C C C C C C C
charge: -0.233005 -0.257384 -0.223129 -0.263067 -0.206588 -0.246965 -0.248155 0.333051 0.030906 0.081406 -0.098776 0.098792 -0.002352 0.185538 -0.008126 0.091387 0.076913 0.279654 -0.018335 -0.064294 -0.078194 0.365549 -0.078509 -0.144997 -0.037333 0.313350 0.285107 0.087612 -0.007284 -0.012772
polarizability: 2.71715056e+02 1.87626151e+01 2.64829615e+02 6.40259471e+00 -7.47239816e+00 2.28973693e+02
1716.lowfreq: -3.8632 -0.0008 0.0003 0.0008 4.4909 6.4338 14.1641 20.7090 26.1290
frequency: 13.9882 20.6169 26.1043 27.6685 36.6505 42.7909 45.8712 57.0709 58.6940 73.3019 79.1184 95.2599 110.0934 127.7998 151.7931 177.4961 182.5195 188.7009 204.4808 209.8318 223.7699 238.1822 245.9669 262.1710 280.1067 292.9190 303.5254 315.4180 344.8751 385.7475 409.2146 431.9039 433.6969 456.0865 483.8725 491.1949 505.6185 547.4099 559.3586 565.3502 576.2063 587.3173 593.4814 601.1050 609.9576 629.4742 640.7288 659.8072 671.9794 706.5678 710.2979 719.5694 739.8722 749.0721 786.5548 795.3546 816.0182 830.9521 847.0099 850.2690 852.8080 854.2598 868.6204 876.1561 890.7783 892.2723 909.8658 920.8669 937.5444 959.9787 977.5170 985.7665 990.1995 992.7684 998.0540 1004.2409 1018.1026 1024.4122 1037.3206 1040.8021 1042.0984 1048.8525 1058.1445 1069.2269 1088.0100 1090.3081 1107.3044 1119.1096 1139.0442 1146.2351 1149.6274 1168.4592 1192.0368 1194.1385 1201.8776 1202.6981 1205.6711 1222.1568 1238.0016 1239.9258 1245.1948 1258.7020 1275.4562 1286.1413 1297.6275 1307.1281 1314.6714 1319.9341 1327.6613 1330.6677 1332.3476 1336.0673 1344.4187 1348.7473 1365.1171 1376.0996 1382.8495 1383.2793 1399.5437 1433.2786 1451.1635 1452.4553 1452.4959 1453.9106 1463.9444 1467.9534 1472.1767 1474.4367 1475.3452 1476.2219 1488.2151 1544.3054 1590.0693 1639.5287 1645.6923 1652.8629 2940.2498 2974.8469 2979.8195 2985.8218 2990.6920 2995.3462 2998.1368 3005.5338 3007.9887 3016.7947 3027.4325 3036.6602 3049.7078 3063.4026 3078.4735 3081.0120 3087.3641 3092.7027 3095.8157 3096.0152 3142.5466 3143.7422 3214.7742 3252.5273 3266.2929 3279.1985
redmass: 6.5331 6.7912 6.2143 5.3449 4.2774 1.3265 4.4424 3.3443 2.0548 1.7446 2.0294 4.0688 3.5473 3.9591 3.5549 4.7864 5.5103 4.1561 4.5245 1.2457 5.1773 3.7940 3.7459 3.0828 3.4824 3.2043 3.1048 3.8915 5.0000 3.9156 5.0014 4.1510 3.9824 4.1818 3.0212 4.4865 4.0588 3.3059 3.0881 3.4851 4.2378 4.1321 4.2556 4.4296 3.8100 3.7753 3.3795 3.5082 3.1334 5.5426 2.9443 1.3669 1.5330 3.0100 1.5418 4.1257 3.7178 5.8186 3.3224 2.5477 2.6373 1.9157 3.5855 2.7786 2.6796 5.4399 2.4217 5.3512 2.9518 2.9084 2.2343 2.2905 2.3962 2.0010 3.1495 3.0058 2.8179 2.5080 4.7088 1.6820 1.6750 2.5143 2.7247 2.1832 2.2876 2.5806 2.6560 2.3302 1.9649 1.5290 1.8324 2.3464 2.2627 2.0875 3.5428 1.6601 1.2423 1.5376 1.5994 1.5717 1.3567 1.3206 1.5076 1.2299 1.7301 1.4505 1.3473 1.3800 1.3619 1.3725 1.2801 1.3682 1.4118 1.4464 1.7839 3.5982 1.2605 1.2469 1.2035 3.8112 1.0610 1.0490 1.0631 1.0475 1.2217 1.1062 1.0907 1.3066 1.0458 2.7292 1.0501 6.7213 6.4320 10.7091 9.1435 9.3265 1.0813 1.0624 1.0665 1.0625 1.0821 1.0369 1.0840 1.0368 1.0367 1.0602 1.0964 1.0848 1.1004 1.1001 1.0940 1.0994 1.0994 1.0971 1.0977 1.0974 1.1011 1.1011 1.0936 1.0997 1.1035 1.1029
irintensity: 0.4458 0.7091 0.6511 0.3176 1.5553 1.2482 0.9225 0.6322 2.1375 0.8305 2.2639 1.4125 1.0369 0.5359 1.0293 1.0552 2.3690 6.4641 5.5260 1.2917 0.7219 0.6575 3.0773 2.3151 0.4828 3.0570 2.7519 2.0610 0.4696 5.6061 4.0018 1.2332 0.3416 4.1584 1.6013 17.3304 6.7616 1.7120 0.6593 12.4786 9.5471 10.2670 2.9621 10.5722 9.0417 2.3082 6.1671 2.0940 5.6524 8.8026 2.7904 34.1976 19.9875 11.1630 61.4061 3.2379 30.3916 193.3107 23.6908 21.9650 23.8897 5.8364 33.5919 11.1009 2.3848 72.1800 85.3686 139.9247 69.5241 4.2328 108.3772 19.7259 32.0906 72.8137 30.1979 14.8282 30.6514 7.8687 31.2575 6.6220 4.9732 4.6839 14.5734 19.0534 11.1368 5.2661 8.3108 0.5600 25.5373 1.4178 2.9274 24.4936 192.1565 72.3995 437.7914 12.5834 1.9000 1.4294 0.8584 3.6293 5.1106 2.9152 1.5070 6.0429 5.1429 2.1547 18.1046 7.9558 3.7130 1.7174 3.5774 8.8073 4.4904 3.4735 18.5188 0.1230 50.4726 64.4841 27.5027 3.1208 24.1047 13.2048 30.3438 18.0372 8.8058 7.0609 6.3317 19.2278 7.6287 11.1358 6.6672 1.0513 0.4335 0.3382 152.2765 205.2442 13.2943 35.9671 20.2934 41.3358 14.2695 15.5914 23.7559 1.5805 2.5471 9.4959 36.1691 3.4406 53.4253 28.8006 3.7247 27.9132 19.3562 4.9558 22.1245 11.3868 12.2231 11.5013 0.9898 0.0490 0.2255 1.2613
temp: 298.150 k
press: 1.00000 atm
elementType: 8 8 8 8 8 8 8 6 6 6 6 6 6 6 6 6 6 6 6 6 6 6 6 6 6 6 6 6 6 6 1 1 1 1 1 1 1 1 1 1 1 1 1 1 1 1 1 1 1 1 1 1 1 1 1 1
symmnumber: 1
zpe: 1175640.3 jmol-1
zpe.correction: 0.447778 hartree
zpe.thermalcorrener: 0.476247 hartree
zpe.thermalcorrenthalpy: 0.477191 hartree
zpe.thermalcorrgfe: 0.384654 hartree
zpe.sumelectzpe: -1416.353438 hartree
zpe.sumelectthermal: -1416.324969 hartree
zpe.sumelectthermalent: -1416.324025 hartree
zpe.sumelectthermalfe: -1416.416562 hartree
dipole: -2.3678 -1.2009 -1.0816
dipole: 2.8668
quadrupole: -178.9638 -159.4498 -183.0840
quadrupole: 6.7713 -6.3365 7.1835
quadrupole: -5.1313 14.3828 -9.2515 6.7713 -6.3365 7.1835
hfenergy: -1416.8012155 hartree
pointgroup: C01 [X(C23H26O7)]
dipole: -0.9259872 -0.5161412 -0.3850543 debye
polarizability: 271.3790929|19.3742165|263.4803337|4.9354966|-10.4641669|230.6589375 unknown
InChI: InChI=1S/C23H26O7/c1-12-20(28-13(2)24)21-19-16(11-27-21)5-4-6-17(19)23(12)9-18(15-7-8-26-10-15)30-22(23)29-14(3)25/h7-8,10-12,17-18,20,22H,4-6,9H2,1-3H3
charge 0 multiplicity 1
56 atoms
O  2.114736 -1.216449 1.004587
O  1.918993 1.15389 1.190354
O  -3.87234 -0.510601 -1.138549
O  -2.833416 2.259699 -0.5062
O  5.28218 -0.316256 -1.716189
O  2.286675 1.446383 3.484444
O  -1.553927 3.39312 -2.100703
C  -0.025346 -0.24428 0.530859
C  -1.015651 -1.324391 1.116444
C  -0.774976 1.138751 0.423188
C  0.610059 -0.670408 -0.834497
C  1.237175 -0.162309 1.429362
C  -2.286981 -1.260594 0.314558
C  -1.927503 1.069465 -0.637291
C  -0.574474 -2.814142 1.180332
C  1.921863 -1.427405 -0.469804
C  -2.709174 -0.175101 -0.419909
C  -3.196821 -2.35596 0.062857
C  -1.767594 -3.690684 1.656114
C  -1.297458 1.642033 1.791806
C  -2.942559 -3.7345 0.632926
C  3.149381 -0.984524 -1.225745
C  -4.155588 -1.861014 -0.807169
C  3.280903 -0.863061 -2.669054
C  4.379238 -0.651048 -0.688384
C  2.461955 1.821484 2.304467
C  -2.536681 3.357545 -1.325079
C  4.577883 -0.457218 -2.924939
C  3.250412 3.027507 1.848332
C  -3.567329 4.447111 -1.127477
H  -1.22901 -1.019944 2.164191
H  -0.037861 1.869916 0.045397
H  0.850652 0.230008 -1.42656
H  -0.075615 -1.302936 -1.423474
H  1.078009 -0.273645 2.513977
H  -1.5035 1.119921 -1.660187
H  0.283254 -2.934685 1.86495
H  -0.248667 -3.163105 0.18014
H  1.791026 -2.521052 -0.577834
H  -2.136507 -3.289914 2.621966
H  -1.41948 -4.722128 1.851103
H  -0.493363 1.639093 2.548983
H  -1.668822 2.676126 1.701583
H  -2.136465 1.030351 2.167359
H  -3.847202 -4.148451 1.117519
H  -2.683085 -4.431911 -0.188911
H  -5.048483 -2.269419 -1.271705
H  2.508227 -1.047564 -3.414084
H  4.760126 -0.598239 0.325542
H  5.138804 -0.230404 -3.826751
H  2.606592 3.702741 1.258184
H  4.074183 2.706572 1.187046
H  3.654928 3.562428 2.719445
H  -3.57567 4.777204 -0.07408
H  -4.57447 4.057671 -1.355249
H  -3.338236 5.299326 -1.782989
