program: Gaussian 09
title: 000012862
version: EM64L-G09RevD.01
frameworkgroup: C1[X(C9H5F2N3S)]
method: RPBEPBE
basis: SDD
operation: Freq
keyword: #p
keyword: freq=noraman
keyword: PBEPBE/SDD
title: #p freq=noraman PBEPBE/SDD
converged: YES YES NO NO
title: Mulliken charges:
elementType: S F F N N N C C C C C C C C C H H H H H
charge: 0.359892 -0.123823 -0.123223 0.023510 0.056462 -0.020752 -0.174985 -0.212940 -0.215652 -0.204653 -0.204076 -0.219953 -0.309467 0.076448 0.071538 0.254793 0.255167 0.237338 0.237367 0.237009
chargesum: 0.00000
title: Mulliken charges with hydrogens summed into heavy atoms:
elementType: S F F N N N C C C C C C C C C
charge: 0.359892 -0.123823 -0.123223 0.023510 0.056462 -0.020752 -0.174985 0.041853 0.039515 0.032684 0.033291 0.017056 -0.309467 0.076448 0.071538
polarizability: 1.91818143e+02 1.28842498e+01 1.14998202e+02 -4.47800503e-01 5.13823611e-01 9.43285825e+01
1716.lowfreq: -12.9284 -8.3025 -6.0434 -0.0011 0.0013 0.0018 9.8846 31.6327 47.2784
frequency: 5.0764 31.5929 47.2780 147.5957 172.2122 190.7612 194.3082 222.9646 275.7830 331.5505 396.2572 401.5026 427.9571 487.7343 539.6272 550.8545 578.8720 608.9319 641.1288 677.0406 684.7187 692.7545 757.2244 777.8131 847.5288 859.9739 883.6989 928.7238 968.7734 979.1289 984.3128 1002.7210 1014.0579 1072.8736 1075.6889 1175.2348 1184.4488 1201.6099 1229.9958 1293.7887 1304.4931 1361.2459 1379.2756 1429.1997 1429.5786 1460.5968 1483.9541 1588.2995 1593.9420 3135.3407 3144.6748 3155.6436 3164.4806 3175.0221
redmass: 4.2101 9.7993 7.5003 12.5439 6.8155 14.3994 15.4558 7.1801 6.1746 15.9033 9.0926 2.7970 16.2614 4.3546 14.5484 16.2850 10.7756 6.4850 12.3430 6.8726 12.3797 2.1578 1.5322 12.6856 1.2461 13.9822 13.9236 1.3761 13.7811 1.3924 6.5167 1.3349 3.4986 2.3217 1.5873 1.0534 1.1168 12.8608 11.7131 12.5700 1.3023 12.4069 10.2939 2.1917 10.1082 2.1233 11.7916 6.0310 6.4638 1.0853 1.0887 1.0931 1.0973 1.1018
irintensity: 0.0072 0.0006 0.6404 0.1524 0.1198 0.0753 1.8336 1.5255 0.0582 1.1920 3.8902 0.0052 0.5039 11.2453 0.1974 0.4440 11.1616 0.1398 5.1914 5.0887 0.0001 41.7241 57.4739 12.3789 0.1279 144.6789 12.2328 3.3964 83.5408 0.1110 15.3534 0.0884 13.2091 2.4615 7.8333 0.0009 11.4633 14.0411 233.1459 134.7248 0.9007 45.0170 2.7739 34.8429 413.4097 56.4387 854.3583 1.5570 1.3743 0.0787 3.8116 12.9835 17.2991 14.2205
temp: 298.150 k
press: 1.00000 atm
elementType: 16 9 9 7 7 7 6 6 6 6 6 6 6 6 6 1 1 1 1 1
symmnumber: 1
zpe: 331065.6 jmol-1
zpe.correction: 0.126096 hartree
zpe.thermalcorrener: 0.138475 hartree
zpe.thermalcorrenthalpy: 0.139419 hartree
zpe.thermalcorrgfe: 0.083372 hartree
zpe.sumelectzpe: -1106.884287 hartree
zpe.sumelectthermal: -1106.871908 hartree
zpe.sumelectthermalent: -1106.870964 hartree
zpe.sumelectthermalfe: -1106.927011 hartree
dipole: 4.7675 -0.0359 0.0039
dipole: 4.7677
quadrupole: -93.4912 -102.0147 -82.3627
quadrupole: 4.5460 -0.1524 0.3002
quadrupole: -0.8683 -9.3919 10.2602 4.5460 -0.1524 0.3002
hfenergy: -1107.0103836 hartree
pointgroup: C01 [X(C9H5F2N3S1)]
dipole: -1.8643911 0.007023 0.2060067 debye
dipolederiv: -0.4468338 0.2140697 -0.069457 0.4561397 0.0275537 -0.0772497 -0.2034864 -0.0520855 0.0296987 -0.2392957 -0.0473372 0.032671 0.1604404 -0.8657526 0.35853 -0.0806249 0.3823718 -0.3785611 -1.1309183 -0.216761 0.2260824 -0.2818705 -0.2867376 0.0900519 0.2624222 0.0827694 -0.2552899 -1.796051 0.1674905 0.0983848 0.2523791 -0.4081544 0.129533 0.0509356 0.1394115 -0.2011355 -0.9011863 0.3439065 -0.0935701 0.7204845 -0.9418242 0.3999659 -0.2988851 0.4430977 -0.2694761 -0.8715716 -0.1930254 0.1857409 -0.0981294 -0.7336178 0.3236455 0.1337746 0.3350138 -0.3608438 0.471929 0.1525391 -0.1312465 0.1935622 -0.0898423 0.0454741 -0.1567358 0.0505034 0.0263129 -0.2011693 0.0785046 0.1171143 -0.1189818 -0.0408113 0.100253 -0.0319965 0.0109858 -0.0407701 -0.2051843 -0.029196 -0.0922345 -0.0278257 -0.0846341 -0.0086231 0.1637983 0.059456 0.0080936 -0.1075919 -0.0041225 -0.0992495 0.0294316 -0.107964 0.0049268 -0.0371197 0.0534635 0.104335 -0.0770141 0.1041645 0.085772 0.0812127 -0.0075631 0.113205 0.0192037 0.066676 -0.0295043 0.0303736 0.1280014 -0.0742873 0.1098718 -0.0341777 -0.0073531 -0.0649405 -0.0093156 -0.0086065 1.8027403 -0.4254848 0.0271631 -0.8234802 0.7234566 -0.3055102 0.2499261 -0.3504459 0.1560371 1.309412 -0.0690775 -0.0766071 -0.335181 1.447827 -0.5964743 0.0679746 -0.6266783 0.6260784 2.0518405 0.1243305 -0.267965 0.0217796 0.9882389 -0.3868082 -0.2132585 -0.3990281 0.5279757 0.0978983 -0.0906509 -0.0469086 -0.073738 0.0584462 -0.0596522 -0.0574224 -0.0440437 0.0587022 0.1306242 -0.019006 0.0762392 0.0019076 0.1090342 -0.0201596 0.0668572 -0.0323364 -0.0223693 0.0663287 -0.0246011 0.06808 -0.0352087 0.1190309 -0.0424149 0.0905253 -0.0449857 -0.0717783 0.036301 -0.0901572 -0.0341452 -0.1144175 0.048586 -0.0832213 -0.0374276 -0.0849587 0.0285006 -0.0206314 -0.1035874 0.0684233 -0.1183763 0.0789057 0.0218812 0.0764798 0.0201289 0.0726005 unknown
polarizability: 189.2695743|10.6637845|109.8004401|-15.9860436|-10.3118545|102.0749127 unknown
InChI: InChI=1S/C9H5F2N3S/c10-7-12-8(11)14-9(13-7)15-6-4-2-1-3-5-6/h1-5H
charge 0 multiplicity 1
20 atoms
S  -0.439429 1.740459 -0.870031
F  1.83464 -2.345807 1.110797
F  4.474381 0.844797 -0.937213
N  2.189853 1.192055 -0.868577
N  0.801358 -0.484852 0.207486
N  3.206262 -0.785526 0.099774
C  -1.847925 0.758183 -0.175623
C  -2.260679 0.989806 1.15347
C  -2.529219 -0.152049 -1.011004
C  -3.375322 0.282214 1.658947
C  -3.64314 -0.854334 -0.496286
C  -4.064889 -0.638683 0.836292
C  0.971876 0.699289 -0.46068
C  1.948279 -1.146168 0.439963
C  3.227193 0.401555 -0.55312
H  -1.7220 1.704773 1.783117
H  -2.195927 -0.3132 -2.040966
H  -3.700937 0.451148 2.690741
H  -4.176041 -1.566535 -1.134996
H  -4.927933 -1.185227 1.231711
