program: Gaussian 09
title: 000178193
version: EM64L-G09RevD.01
frameworkgroup: C1[X(C4H2ClF3N2S)]
method: RPBEPBE
basis: SDD
operation: Freq
keyword: #p
keyword: freq=noraman
keyword: PBEPBE/SDD
title: #p freq=noraman PBEPBE/SDD
converged: NO YES NO YES
title: Mulliken charges:
elementType: Cl S F F F N N C C C C H H
charge: 0.063411 0.332053 -0.152442 -0.152692 -0.152716 -0.016931 -0.560383 0.433330 0.310824 -0.629179 -0.163308 0.337904 0.350129
chargesum: 0.00000
title: Mulliken charges with hydrogens summed into heavy atoms:
elementType: Cl S F F F N N C C C C
charge: 0.063411 0.332053 -0.152442 -0.152692 -0.152716 -0.016931 0.127650 0.433330 0.310824 -0.629179 -0.163308
polarizability: 1.03562065e+02 -1.39800899e+01 1.06098882e+02 4.10374269e-03 3.83750410e-03 3.87876581e+01
1716.lowfreq: -8.9542 0.0011 0.0015 0.0025 6.3748 7.1867 19.8216 102.3901 125.4654
frequency: 19.3370 102.3892 125.4633 147.1600 198.6988 250.1759 289.7988 307.9967 321.5648 354.7241 373.0660 416.7519 460.5805 469.9045 499.0641 564.1872 577.5112 623.0158 643.4647 674.4078 800.4010 953.8965 993.5668 1003.7759 1044.6275 1161.7051 1269.3995 1332.8692 1523.1083 1584.3697 1636.7780 3551.2362 3702.9039
redmass: 17.5513 19.6904 7.1903 14.7546 10.1761 3.0693 9.4304 1.6474 12.2247 6.4444 9.6231 10.5587 1.4987 4.9764 12.6708 6.5152 6.5113 12.0028 10.4185 12.5099 11.5127 12.1119 13.0005 3.1201 8.4645 4.2753 3.6691 11.3181 11.4593 1.7534 2.4477 1.0458 1.1044
irintensity: 0.0945 0.1064 4.4001 0.4247 2.5804 5.4477 1.6275 46.3041 1.7674 7.0183 1.4187 5.9516 263.6639 19.7095 0.1247 12.7684 10.3274 16.8135 12.5513 7.8417 74.6295 69.2056 258.4633 77.7343 169.6974 178.9800 115.9101 57.0594 63.1700 44.0144 496.8438 142.7253 58.7059
temp: 298.150 k
press: 1.00000 atm
elementType: 17 16 9 9 9 7 7 6 6 6 6 1 1
symmnumber: 1
zpe: 167345.0 jmol-1
zpe.correction: 0.063738 hartree
zpe.thermalcorrener: 0.074579 hartree
zpe.thermalcorrenthalpy: 0.075523 hartree
zpe.thermalcorrgfe: 0.025594 hartree
zpe.sumelectzpe: -1419.941007 hartree
zpe.sumelectthermal: -1419.930167 hartree
zpe.sumelectthermalent: -1419.929222 hartree
zpe.sumelectthermalfe: -1419.979151 hartree
dipole: 6.2186 -0.0374 0.0000
dipole: 6.2187
quadrupole: -61.9361 -74.1033 -78.6153
quadrupole: -10.5043 0.0004 0.0016
quadrupole: 9.6155 -2.5517 -7.0637 -10.5043 0.0004 0.0016
hfenergy: -1420.0047452 hartree
pointgroup: C01 [X(C4H2Cl1F3N2S1)]
dipole: 2.4457714 0.0652552 -0.0024351 debye
dipolederiv: -0.2026948 0.2739143 0.000079 0.3396726 -0.5360934 0.0000112 0.0001833 -0.0001499 0.0652929 -0.2654931 -0.1487946 0.0003973 0.1125234 -0.4678307 0.0000907 0.0003061 0.0001588 0.1503696 -0.6466073 0.1802673 0.0000386 0.1752293 -0.5034743 0.0001671 0.0001259 0.0001813 -0.2800207 -0.496283 -0.2045869 -0.1119106 -0.195088 -0.521917 -0.2505238 -0.122746 -0.2594468 -0.6360184 -0.4959688 -0.2039335 0.1120007 -0.1943793 -0.5207822 0.2505443 0.1230318 0.2596857 -0.6376451 -1.1265051 0.3254879 0.0006436 -0.2387627 -0.5873767 0.0003441 0.001097 -0.0001178 -0.2053616 -1.1776852 0.6411212 0.0002474 0.6770699 -0.6816932 -0.0007033 0.0000677 -0.0005367 -0.6981507 -0.1439953 -0.3601338 0.0002331 -0.2812353 0.0690999 0.000154 0.0001317 0.000125 -0.061417 1.8812759 0.4733818 -0.0004959 0.2167361 1.5649229 -0.0001964 -0.0005451 -0.0006083 1.5968261 0.626177 -0.2761289 -0.0004481 -0.224244 0.7223072 -0.0002896 -0.0007936 0.0002417 -0.2152014 1.5625407 -0.6249962 -0.0011139 -0.2883465 1.0503008 0.0001601 -0.0011899 0.0002369 0.1047768 0.3048397 -0.0622561 0.0001173 -0.0156512 0.1417247 0.0001152 0.0000968 0.0001533 0.410746 0.1803992 -0.0133426 0.0002115 -0.0835243 0.270812 0.0001263 0.0002343 0.0000768 0.4058037 unknown
polarizability: 104.4780523|-14.0331081|105.1828398|-0.0531813|-0.0160911|38.7877124 unknown
InChI: InChI=1S/C4H2ClF3N2S/c5-2-1(4(6,7)8)10-3(9)11-2/h9H2
charge 0 multiplicity 1
13 atoms
Cl -0.589808 2.836148 -0.000848
S  2.119421 1.359895 -0.002195
F  -2.516331 0.531169 0.001604
F  -1.844204 -1.314926 -1.12873
F  -1.842155 -1.312224 1.135262
N  0.843763 -1.004691 -0.000333
N  3.220463 -1.223525 -0.002532
C  -0.148688 -0.013856 0.000213
C  -1.564685 -0.507599 0.002035
C  0.298041 1.295973 -0.001038
C  2.062657 -0.490807 -0.001791
H  4.139112 -0.790808 -0.003539
H  3.140213 -2.239049 -0.002107
