program: Gaussian 09
title: 000178214
version: EM64L-G09RevD.01
frameworkgroup: C1[X(C15H13FN2O5)]
method: RPBEPBE
basis: SDD
operation: Freq
keyword: #p
keyword: freq=noraman
keyword: PBEPBE/SDD
title: #p freq=noraman PBEPBE/SDD
converged: YES YES NO NO
title: Mulliken charges:
elementType: F O O O O O N N C C C C C C C C C C C C C C C H H H H H H H H H H H H H
charge: -0.168110 -0.153265 -0.171792 -0.272164 -0.195451 -0.191614 -0.371325 0.020122 0.148430 0.150037 -0.496099 -0.494312 -0.416059 -0.416342 0.074480 0.059897 0.376051 -0.427670 0.237756 0.230648 -0.507405 0.324995 -0.515656 0.242579 0.254365 0.239359 0.252787 0.222151 0.214299 0.221111 0.215797 0.286786 0.306433 0.257495 0.240335 0.221352
chargesum: 0.00000
title: Mulliken charges with hydrogens summed into heavy atoms:
elementType: F O O O O O N N C C C C C C C C C C C C C C C
charge: -0.168110 -0.153265 -0.171792 -0.272164 -0.195451 -0.191614 -0.371325 0.020122 0.148430 0.150037 0.000845 -0.002167 0.020391 0.020566 0.074480 0.059897 0.376051 -0.140883 0.237756 0.230648 -0.200972 0.324995 0.203526
polarizability: 3.01223772e+02 2.19307628e+00 2.06863843e+02 -1.30594990e+00 -6.03190471e+00 1.14793527e+02
1716.lowfreq: -5.2242 -0.0006 -0.0005 -0.0003 2.6727 7.9288 30.5454 36.7358 38.2475
frequency: 30.5411 36.6909 38.1298 48.5204 91.0601 103.1401 108.4639 118.1951 132.8408 147.9528 161.2049 189.9801 197.9117 204.1696 227.4245 240.5877 276.4069 283.4747 296.0888 323.8213 329.5394 360.4153 420.9656 423.1085 444.9343 452.8397 461.6000 480.8135 525.5528 543.0222 590.0151 619.9799 640.2860 661.9295 684.2474 706.1393 715.0546 733.1965 735.1803 747.2393 749.0583 799.4306 818.1642 853.7651 862.0779 879.2016 894.8279 896.4538 923.4563 955.6359 1004.8889 1026.6849 1069.9389 1077.8477 1079.6406 1097.6867 1104.3109 1126.3620 1149.2485 1156.9193 1160.8526 1195.5426 1214.6084 1229.5802 1230.2160 1231.8552 1248.6262 1268.0255 1329.3140 1331.3609 1338.9363 1353.1074 1359.9668 1376.0727 1386.0395 1408.4089 1437.4747 1445.6292 1450.9924 1453.6352 1471.0075 1472.7161 1478.8643 1491.7837 1570.4709 1612.3106 1630.5690 1665.8716 1682.3180 2974.4233 2975.2653 2980.7366 2989.6646 2993.1520 3033.1573 3034.7670 3056.8078 3063.2554 3090.2945 3138.6810 3185.3067 3189.4526
redmass: 7.0865 5.6554 5.5496 10.0160 5.4071 3.1839 3.6980 4.2207 7.2052 1.0869 6.0712 8.7561 9.0018 5.9354 6.5781 3.2536 1.9635 6.1173 9.4542 5.4648 6.3470 9.5112 10.4812 4.1024 4.8385 3.3379 3.5730 7.9773 7.3285 3.0181 5.3249 7.9570 7.7027 7.0005 5.2924 6.6837 6.4944 4.7807 4.5894 6.2213 5.5146 5.1265 1.7261 2.5129 2.8413 1.7458 1.4879 1.5256 7.4438 2.6242 6.5486 7.5869 2.6381 3.6029 2.1113 1.9154 1.2318 1.1506 1.4080 2.4248 1.7810 2.9704 8.9640 1.3938 1.4960 1.3928 5.5976 1.2744 6.9319 1.3492 1.4809 1.6930 5.8329 10.4325 3.1335 4.0542 1.4909 1.1139 1.0741 1.0749 1.0905 1.0877 1.0535 4.1595 10.3395 7.9199 12.8952 8.3541 12.5016 1.0652 1.0652 1.0325 1.0663 1.0611 1.0930 1.0941 1.0981 1.1039 1.1016 1.1036 1.0927 1.0929
irintensity: 0.1913 1.3547 1.3867 0.3307 0.6213 1.4911 3.6957 0.6118 5.6686 0.2557 7.3827 0.3370 0.9185 2.9786 1.7489 0.3701 1.7015 5.2922 2.8429 6.7068 3.6208 4.2955 0.9616 4.1138 4.2514 0.7360 8.9472 4.3030 7.5598 1.9209 2.9513 7.1309 3.3162 0.8755 1.7100 21.4026 41.9075 14.4365 18.2515 6.8578 5.4540 27.0757 2.9464 2.0513 15.7782 14.0347 24.4702 11.1319 52.7341 11.7208 6.1794 40.9396 16.6100 0.3925 2.3371 19.4657 0.6617 1.7280 9.0571 59.3991 72.2410 7.3565 479.5758 3.7309 7.6582 3.3562 132.1421 8.0478 386.2711 1.3666 4.3692 14.5458 92.8796 54.0021 4.7217 112.1054 39.6983 2.5484 39.2307 20.4945 12.1014 9.2850 17.5850 320.6992 50.5073 97.0044 419.7127 59.3438 4.6419 9.6810 5.3992 55.6749 29.9547 30.6246 21.9957 2.9006 54.9537 42.9985 22.6876 17.0734 0.7751 9.4532
temp: 298.150 k
press: 1.00000 atm
elementType: 9 8 8 8 8 8 7 7 6 6 6 6 6 6 6 6 6 6 6 6 6 6 6 1 1 1 1 1 1 1 1 1 1 1 1 1
symmnumber: 1
zpe: 683602.3 jmol-1
zpe.correction: 0.260370 hartree
zpe.thermalcorrener: 0.281006 hartree
zpe.thermalcorrenthalpy: 0.281950 hartree
zpe.thermalcorrgfe: 0.209871 hartree
zpe.sumelectzpe: -1163.109725 hartree
zpe.sumelectthermal: -1163.089090 hartree
zpe.sumelectthermalent: -1163.088145 hartree
zpe.sumelectthermalfe: -1163.160225 hartree
dipole: -7.7095 3.1789 -0.6789
dipole: 8.3668
quadrupole: -130.1666 -135.1975 -133.5754
quadrupole: 7.2035 -3.9459 4.5331
quadrupole: 2.8133 -2.2177 -0.5956 7.2035 -3.9459 4.5331
hfenergy: -1163.3700953 hartree
pointgroup: C01 [X(C15H13F1N2O5)]
dipole: -3.0381946 -1.2498719 0.2067516 debye
polarizability: 301.1298739|-2.2219585|206.9727057|4.2720798|-5.2137537|114.7785629 unknown
InChI: InChI=1S/C15H13FN2O5/c1-23-13-7-11(10(16)6-12(13)18(21)22)17-14(19)8-4-2-3-5-9(8)15(17)20/h6-7H,2-5H2,1H3
charge 0 multiplicity 1
36 atoms
F  0.269308 2.330686 1.204007
O  -1.533816 2.133202 -1.047168
O  -1.218697 -2.125856 0.95219
O  3.440443 -1.745969 -0.991791
O  5.165876 1.848674 0.266702
O  5.483501 -0.406787 0.384306
N  -0.96542 0.069164 0.027981
N  4.727605 0.632706 0.274322
C  -3.251852 0.507347 -0.294393
C  -3.159234 -0.737444 0.265388
C  -4.536404 1.182836 -0.676651
C  -4.330363 -1.609998 0.613937
C  -5.700641 0.155236 -0.661503
C  -5.638458 -0.773906 0.580086
C  -1.873483 1.064411 -0.496618
C  -1.715365 -1.077425 0.47857
C  0.4475 0.186122 0.073415
C  1.280103 -0.840667 -0.420649
C  1.067381 1.334665 0.631472
C  2.689505 -0.749898 -0.36467
C  2.453644 1.487376 0.660759
C  3.266253 0.435093 0.182521
C  3.826769 -2.9116 -0.157934
H  -4.737751 2.010527 0.034299
H  -4.434653 1.663738 -1.668007
H  -4.389143 -2.452233 -0.105833
H  -4.177844 -2.077033 1.605328
H  -6.667244 0.690348 -0.684769
H  -5.651711 -0.463509 -1.579329
H  -6.511254 -1.451758 0.587685
H  -5.700069 -0.157083 1.498293
H  0.837597 -1.728151 -0.879354
H  2.911039 2.392669 1.067424
H  4.537638 -2.593365 0.622506
H  4.312397 -3.609324 -0.855178
H  2.928542 -3.379194 0.288455
