program: Gaussian 09
title: 000178420
version: EM64L-G09RevD.01
frameworkgroup: C1[X(C23H29NO7)]
method: RPBEPBE
basis: SDD
operation: Freq
keyword: #p
keyword: freq=noraman
keyword: PBEPBE/SDD
title: #p freq=noraman PBEPBE/SDD
converged: YES YES NO NO
title: Mulliken charges:
elementType: O O O O O O O N C C C C C C C C C C C C C C C C C C C C C C C H H H H H H H H H H H H H H H H H H H H H H H H H H H H H
charge: -0.215003 -0.443377 -0.474059 -0.497360 -0.278836 -0.389974 -0.342027 -0.126453 -0.038604 -0.179574 -0.142015 -0.370055 -0.176242 -0.195225 -0.586520 -0.629508 -0.317023 0.117203 -0.316219 0.402926 0.494006 -0.420613 -0.431139 -0.345576 -0.358106 -0.226084 -0.233732 -0.260278 -0.231273 -0.250477 -0.237779 0.275613 0.235888 0.271340 0.253959 0.343884 0.280099 0.239284 0.256987 0.260521 0.254280 0.328030 0.311502 0.223563 0.275690 0.201289 0.380024 0.370258 0.361035 0.191719 0.231928 0.224892 0.284168 0.255671 0.224512 0.225764 0.251612 0.227942 0.228183 0.229360
chargesum: 0.00000
title: Mulliken charges with hydrogens summed into heavy atoms:
elementType: O O O O O O O N C C C C C C C C C C C C C C C C C C C C C C C
charge: -0.215003 -0.063353 -0.103801 -0.136326 -0.278836 -0.389974 -0.342027 -0.126453 0.237009 0.056314 0.129326 0.227788 0.103857 0.044059 0.185268 0.233588 0.159956 0.117203 -0.124500 0.402926 0.494006 -0.188685 -0.206247 -0.061408 -0.102436 -0.001572 -0.007968 -0.008666 -0.003331 -0.022295 -0.008419
polarizability: 3.11065085e+02 -2.51662537e+01 2.68989550e+02 -2.60627485e-01 6.96278013e+00 2.31958157e+02
1716.lowfreq: -15.3287 -10.2140 -4.1500 -0.0003 0.0003 0.0006 9.7231 14.9339 19.6618
frequency: 8.4125 13.6793 19.5407 30.0977 41.8763 47.9911 55.5513 66.3913 76.6705 103.4234 115.6796 136.2469 143.2941 161.5396 180.6001 189.7472 201.3413 209.6572 217.9940 229.6192 232.1984 236.4638 245.4478 256.5953 277.0521 279.2938 286.0496 308.5471 321.9555 337.9430 345.1468 364.7100 378.7065 402.6870 404.7758 412.3343 419.6771 435.0759 455.2183 477.7579 493.6078 500.3376 528.3350 538.3249 565.6921 601.0986 605.7443 614.1183 619.2399 636.1197 648.9982 655.2475 702.7480 708.1821 710.6184 722.5358 751.6724 764.8621 777.9946 782.0471 823.7397 826.4613 837.9059 853.4990 859.0743 863.2766 868.0072 894.5521 903.6024 918.7684 933.4347 938.0086 941.6687 944.6853 951.0821 978.4111 979.2906 983.3005 989.3945 991.6104 992.9433 996.2454 998.8274 1007.1231 1023.5170 1026.0110 1039.5002 1054.9503 1064.3857 1072.2860 1079.8597 1085.9564 1104.3262 1116.9058 1127.3734 1145.1095 1169.4007 1172.1822 1177.3724 1179.4298 1184.2841 1188.5479 1189.7197 1197.4489 1211.9146 1214.4177 1230.1529 1239.9061 1239.9926 1258.7648 1274.5440 1284.4441 1287.5531 1294.4216 1302.7835 1318.9623 1321.8108 1329.1511 1338.8125 1354.3351 1359.6826 1367.5901 1382.4440 1384.3159 1388.7193 1406.1615 1426.8739 1431.3156 1435.8454 1441.3623 1450.4182 1456.6454 1465.5634 1474.5277 1477.7963 1479.9289 1482.8852 1485.2135 1492.6745 1509.6850 1580.4770 1591.0112 1595.4961 1610.6277 1613.6060 2597.5163 2931.8709 2938.3523 2999.5247 3007.5957 3010.9095 3022.5771 3026.4663 3037.3424 3038.5376 3047.6221 3055.6314 3086.9099 3110.8372 3111.3370 3114.8130 3127.4313 3127.5773 3133.0213 3140.1060 3140.9962 3143.7693 3144.3341 3152.0536 3157.6647 3165.1913 3174.0096 3319.9841 3576.6295
redmass: 5.8367 4.4243 4.6428 6.8075 5.3199 6.2738 5.6636 4.6480 5.7794 5.5769 7.6364 2.2742 3.6651 3.9586 2.7351 4.4350 1.8915 4.1814 3.1458 5.1500 3.9968 1.2675 3.8799 4.0755 3.0273 2.1681 4.0816 2.9060 6.1577 4.3309 4.8499 3.9400 3.2428 2.8067 2.9144 4.1903 5.4350 6.7255 3.6690 3.5914 3.8247 4.9336 5.9135 3.0708 3.5229 6.5012 5.7811 6.4052 5.9092 4.7765 5.2937 1.2749 1.7369 2.0146 3.9042 8.1433 1.8531 2.0644 5.9361 1.9108 3.5719 2.1655 2.7710 1.2496 3.5345 1.3458 3.5584 3.3275 3.2691 3.0069 1.4378 1.6709 2.2180 3.1575 3.1757 1.4047 2.6617 1.4571 4.8654 6.0636 4.6730 4.6228 1.4386 1.3796 2.0728 2.1798 2.2885 2.9797 1.6863 2.1061 1.6027 1.5833 2.2572 1.4222 2.7127 1.6579 1.0600 1.0730 1.4415 1.5897 1.3010 1.1991 1.4086 1.5196 1.8654 1.7816 1.9650 1.3914 1.6965 1.4442 1.5547 1.4548 1.2074 1.3233 1.2540 1.3349 1.2449 1.4321 1.3603 1.2672 1.3298 1.4149 4.2354 1.3858 6.3391 1.2681 1.1557 1.1510 2.1473 2.1309 1.1065 1.1804 1.1335 1.0540 2.2271 1.0640 2.2625 1.1207 1.1928 1.0829 3.3376 6.0470 6.0695 6.1463 6.1270 1.0808 1.0801 1.0674 1.0369 1.0590 1.0838 1.0331 1.0852 1.0868 1.0960 1.0871 1.0865 1.1084 1.1056 1.0872 1.0872 1.0873 1.0874 1.1037 1.0917 1.1032 1.1032 1.0929 1.0956 1.0970 1.1011 1.0967 1.0665 1.0665
irintensity: 0.3595 0.0969 0.1937 1.3840 3.6976 0.6304 0.6984 0.3732 0.4411 14.1154 8.6030 2.4586 0.0450 9.8784 4.8257 5.4205 1.0203 2.1178 1.3228 2.3880 1.5219 3.3314 11.5144 7.5215 23.8628 87.3027 5.9715 53.6628 5.4926 8.8014 0.1826 12.7697 7.1383 0.1485 0.1552 4.5202 10.8010 0.9087 7.3306 5.1966 3.8765 13.6380 9.5421 9.7332 1.6784 3.9411 9.7346 0.0666 9.0888 5.9507 20.7877 187.4446 45.0731 65.2145 49.8996 39.9308 52.9225 70.3109 40.7457 18.2085 3.0358 12.5461 5.3684 0.0619 11.2443 12.6086 13.9070 1.2162 39.0863 22.7339 22.2080 72.8366 18.6126 76.9747 75.1543 0.6818 82.8252 1.9583 3.9428 1.1237 87.0840 153.7878 18.1945 10.3279 4.5497 7.4645 30.9277 61.2180 5.5515 30.9547 0.8743 17.6697 2.6620 5.8171 11.4316 3.1204 1.1091 0.3620 12.5030 11.6098 12.1132 8.2700 16.9068 18.2708 7.2136 17.7428 102.2662 2.7825 9.7394 35.0755 22.6544 12.2287 10.4938 1.9113 0.4246 6.3598 3.6482 22.3550 2.4507 10.7150 0.6572 5.6557 3.1351 0.6983 0.8322 4.6678 111.0916 21.0116 28.7166 9.5403 21.8515 111.5114 15.1787 10.5781 6.1917 67.3097 13.4737 16.4735 95.0467 107.6552 257.9209 1.5495 0.8138 1.3503 0.2505 807.9976 18.9868 94.5484 30.1572 49.0974 15.3813 9.4498 11.8093 37.0052 14.1675 7.2559 31.8375 9.2731 5.0259 6.3779 7.8085 3.5594 4.8433 7.4992 20.3429 9.8013 2.5292 26.2385 32.3135 26.4758 23.3143 2.3697 148.5973 6.8473
temp: 298.150 k
press: 1.00000 atm
elementType: 8 8 8 8 8 8 8 7 6 6 6 6 6 6 6 6 6 6 6 6 6 6 6 6 6 6 6 6 6 6 6 1 1 1 1 1 1 1 1 1 1 1 1 1 1 1 1 1 1 1 1 1 1 1 1 1 1 1 1 1
symmnumber: 1
zpe: 1277979.2 jmol-1
zpe.correction: 0.486757 hartree
zpe.thermalcorrener: 0.516375 hartree
zpe.thermalcorrenthalpy: 0.517319 hartree
zpe.thermalcorrgfe: 0.423655 hartree
zpe.sumelectzpe: -1472.746621 hartree
zpe.sumelectthermal: -1472.717003 hartree
zpe.sumelectthermalent: -1472.716058 hartree
zpe.sumelectthermalfe: -1472.809722 hartree
dipole: 3.3282 -2.7608 -6.0093
dipole: 7.4034
quadrupole: -202.6488 -151.6456 -202.5793
quadrupole: -4.3353 6.7794 -0.0908
quadrupole: -17.0242 33.9790 -16.9548 -4.3353 6.7794 -0.0908
hfenergy: -1473.2333774 hartree
pointgroup: C01 [X(C23H29N1O7)]
dipole: -1.5272643 1.0342232 -2.2542763 debye
polarizability: 314.2379179|-22.1827787|265.8047649|-4.7641505|-4.8943653|231.9701091 unknown
InChI: InChI=1S/C23H29NO7/c1-24(2,22-19(27)17(25)18(26)21(31-22)23(28)29)13-14-30-20(15-9-5-3-6-10-15)16-11-7-4-8-12-16/h3-12,17-22,25-27H,13-14H2,1-2H3
charge 0 multiplicity 1
60 atoms
O  1.991563 -0.123503 -0.674946
O  4.014604 0.925089 -2.877815
O  5.15533 1.324146 0.650564
O  4.448676 -1.47895 -1.666662
O  -1.927411 1.222302 -0.145636
O  3.805461 -0.020839 2.340133
O  1.531861 -0.505156 2.169325
N  1.688942 2.337215 -0.224463
C  2.362724 1.160258 -1.142018
C  3.870829 1.362221 -1.483938
C  4.875123 0.598162 -0.56678
C  0.299069 1.85927 0.24353
C  4.361404 -0.845432 -0.317987
C  2.922458 -0.897447 0.22022
C  1.572296 3.571755 -1.105433
C  2.482559 2.719781 1.026714
C  -0.650954 1.375118 -0.862044
C  2.73215 -0.447609 1.718975
C  -2.829164 0.188778 -0.735693
C  -2.259541 -1.222916 -0.57391
C  -4.185174 0.409851 -0.070296
C  -2.653182 -2.237736 -1.482379
C  -5.118105 1.288387 -0.675488
C  -1.364532 -1.547284 0.475478
C  -4.520672 -0.211429 1.157328
C  -2.173516 -3.558122 -1.336821
C  -6.366006 1.545945 -0.06654
C  -0.872896 -2.864571 0.614571
C  -5.765728 0.048214 1.771518
C  -1.280609 -3.876029 -0.285116
C  -6.6922 0.92593 1.162045
H  1.810891 1.295183 -2.088827
H  4.142005 2.431317 -1.469715
H  5.810614 0.517455 -1.152395
H  -0.15876 2.711268 0.777953
H  0.474491 1.033301 0.953907
H  5.029433 -1.367484 0.391585
H  2.503043 -1.916784 0.131102
H  0.954967 4.318895 -0.58222
H  2.57554 3.985444 -1.285985
H  1.103779 3.313122 -2.066206
H  2.364445 1.937906 1.788806
H  3.553842 2.809501 0.784001
H  2.070176 3.669432 1.406255
H  -0.304556 0.406668 -1.266782
H  -0.780882 2.107162 -1.688485
H  4.165991 -0.067717 -2.836992
H  4.750763 0.792194 1.456633
H  4.014076 -2.367708 -1.657526
H  -2.937219 0.40759 -1.822168
H  -3.344133 -1.996694 -2.300689
H  -4.862359 1.775559 -1.625122
H  -1.029286 -0.776423 1.175516
H  -3.812065 -0.901976 1.626105
H  -2.490633 -4.334777 -2.042172
H  -7.080316 2.224639 -0.546031
H  -0.171951 -3.082945 1.427568
H  -6.01516 -0.436592 2.721954
H  -0.906081 -4.900037 -0.172781
H  -7.660213 1.121603 1.637071
