program: Gaussian 09
title: 000178213
version: EM64L-G09RevD.01
frameworkgroup: C1[X(C16H16FNO3S)]
method: RPBEPBE
basis: SDD
operation: Freq
keyword: #p
keyword: freq=noraman
keyword: PBEPBE/SDD
title: #p freq=noraman PBEPBE/SDD
converged: YES YES NO NO
title: Mulliken charges:
elementType: S F O O O N C C C C C C C C C C C C C C C C H H H H H H H H H H H H H H H H
charge: 0.191578 -0.179584 -0.177905 -0.163385 -0.308262 -0.370856 0.148143 0.147074 -0.494298 -0.496492 -0.415953 -0.415791 0.054803 0.070361 0.368139 -0.447226 0.212728 0.490147 -0.388185 -0.393508 -0.521054 -0.840256 0.250350 0.236362 0.251219 0.239367 0.214304 0.217879 0.212597 0.218662 0.279704 0.283923 0.241169 0.229565 0.231555 0.249664 0.304951 0.268509
chargesum: 0.00000
title: Mulliken charges with hydrogens summed into heavy atoms:
elementType: S F O O O N C C C C C C C C C C C C C C C C
charge: 0.191578 -0.179584 -0.177905 -0.163385 -0.308262 -0.370856 0.148143 0.147074 -0.007586 -0.005906 0.016230 0.015469 0.054803 0.070361 0.368139 -0.167521 0.212728 0.490147 -0.104262 -0.393508 0.181236 -0.017133
polarizability: 3.02116555e+02 -7.96909738e-01 1.97008348e+02 -5.64763070e+00 -5.30658891e+00 1.37696476e+02
1716.lowfreq: -4.8337 -3.9364 -0.0025 -0.0018 -0.0016 4.4871 29.9096 30.5833 41.4206
frequency: 29.8030 30.4239 41.2486 69.8260 78.9515 87.7703 101.6526 116.4234 128.4767 146.8021 157.1294 171.0610 175.9344 198.6625 217.1319 225.3441 238.7686 243.9402 277.2893 297.1922 309.0729 323.7131 338.1863 416.0842 428.8490 450.9322 457.2442 461.1605 481.8028 529.7760 542.0097 570.4511 622.6684 640.7377 663.7766 666.8572 695.3040 716.9104 730.0544 734.5221 746.9431 780.5380 818.6140 848.5573 862.7911 869.6417 893.0943 897.1590 912.2211 954.1666 977.6436 983.9679 1000.6989 1036.5496 1057.4053 1076.4486 1079.5534 1093.8619 1111.3371 1124.2889 1138.7643 1153.2733 1158.7543 1191.3330 1221.8890 1230.0439 1230.8762 1245.6390 1266.3697 1327.3257 1329.7738 1337.0146 1337.6854 1352.3310 1355.6773 1386.1496 1389.1660 1435.7825 1443.8908 1445.9453 1451.1229 1459.2713 1472.1013 1472.4210 1473.9811 1475.6096 1478.5050 1568.0427 1606.9553 1626.6093 1669.8354 1678.5904 2970.2826 2973.4639 2974.7189 2987.4079 2990.5954 3015.4452 3032.0256 3033.7560 3054.1538 3060.6774 3068.4840 3122.4751 3139.7537 3150.0087 3175.9675 3179.7538
redmass: 5.4426 5.0729 5.1065 3.2074 3.6798 4.2806 3.4374 4.0655 5.6324 1.7588 1.6407 1.3847 3.9230 5.2735 5.9635 6.5564 3.1624 5.2341 1.9816 8.1175 6.4824 5.1651 6.2110 7.0071 4.1489 3.3804 5.2975 5.7829 3.9216 6.7010 3.0971 5.1535 8.0608 7.2419 7.2001 7.3080 5.8259 6.2206 3.2679 4.8078 4.4727 5.6383 1.7438 2.4883 2.6576 1.6085 1.6566 1.5902 5.3800 2.6058 1.2544 3.3228 1.4131 7.5480 3.0588 3.6085 2.0720 1.9857 1.2376 1.1533 1.9065 1.7812 1.5376 2.7091 1.3110 1.3139 1.6206 5.9060 1.2655 2.7219 1.4377 1.4734 1.4205 1.6701 8.8405 3.1977 4.0766 1.2588 1.1259 1.1121 1.0743 1.0530 1.0898 1.0550 1.0877 1.3616 2.1871 9.5032 8.0850 12.8886 8.5876 12.3376 1.0305 1.0651 1.0651 1.0661 1.0610 1.0275 1.0931 1.0941 1.0980 1.1039 1.1051 1.1021 1.1047 1.1064 1.0925 1.0932
irintensity: 1.4219 0.7557 1.4105 5.5377 1.7748 0.1528 1.6360 0.3581 2.3104 2.5670 3.1455 0.8947 1.1178 0.5373 1.2032 0.8471 0.4139 1.4105 1.8529 5.5904 4.9254 9.4337 2.2001 7.7899 0.5376 3.1670 3.6167 7.7198 8.3455 3.4393 3.0916 0.6779 6.4576 1.9192 1.7698 4.3699 15.1357 44.2126 8.5637 3.0947 8.3845 9.2391 2.3539 8.4293 10.6903 23.7044 16.4831 6.3354 47.9400 8.5717 22.3257 15.7247 27.3434 35.7647 21.5823 0.4396 0.4347 5.9928 2.9265 1.6756 59.8509 20.7693 17.1430 18.5378 3.8411 4.1854 6.6610 167.7261 6.8968 128.5809 16.1652 5.4854 60.6188 11.8078 9.4168 3.2679 116.2167 28.6961 16.2906 1.9340 35.8742 11.4286 11.7560 1.6719 9.7185 36.7910 324.5219 18.0132 15.8110 413.9921 38.6391 3.2965 60.6399 11.2150 7.4552 31.2577 31.4166 35.1830 24.7148 3.0163 58.9931 46.4316 23.5199 24.2634 11.1011 2.4798 0.3683 0.7021
temp: 298.150 k
press: 1.00000 atm
elementType: 16 9 8 8 8 7 6 6 6 6 6 6 6 6 6 6 6 6 6 6 6 6 1 1 1 1 1 1 1 1 1 1 1 1 1 1 1 1
symmnumber: 1
zpe: 755316.9 jmol-1
zpe.correction: 0.287685 hartree
zpe.thermalcorrener: 0.309095 hartree
zpe.thermalcorrenthalpy: 0.310039 hartree
zpe.thermalcorrgfe: 0.236348 hartree
zpe.sumelectzpe: -1396.021109 hartree
zpe.sumelectthermal: -1395.999699 hartree
zpe.sumelectthermalent: -1395.998755 hartree
zpe.sumelectthermalfe: -1396.072446 hartree
dipole: 2.3298 2.0055 0.9219
dipole: 3.2094
quadrupole: -99.4909 -140.3565 -137.3656
quadrupole: -1.2891 -2.0819 2.2873
quadrupole: 26.2468 -14.6188 -11.6280 -1.2891 -2.0819 2.2873
hfenergy: -1396.308794 hartree
pointgroup: C01 [X(C16H16F1N1O3S1)]
dipole: -0.8968915 -0.755784 0.4676417 debye
polarizability: 302.2005194|1.8383613|197.442428|3.6950719|-1.9682776|137.178432 unknown
InChI: InChI=1S/C16H16FNO3S/c1-21-13-8-12(11(17)7-14(13)22-2)18-15(19)9-5-3-4-6-10(9)16(18)20/h7-8H,3-6H2,1-2H3
charge 0 multiplicity 1
38 atoms
S  5.240265 0.768593 -0.715153
F  0.323889 2.08581 -1.828664
O  -1.087099 -2.175996 -0.729383
O  -1.353432 2.333604 0.618361
O  3.694781 -1.407155 0.985345
N  -0.814726 0.127673 -0.138875
C  -3.008545 -0.709041 -0.159611
C  -3.087625 0.604489 0.210302
C  -4.185478 -1.628893 -0.314819
C  -4.359897 1.327454 0.543972
C  -5.501177 -0.803744 -0.335556
C  -5.509189 0.304521 0.751928
C  -1.569212 -1.069607 -0.38853
C  -1.703993 1.186573 0.26257
C  0.599158 0.248665 -0.264471
C  1.475001 -0.630564 0.410592
C  1.170815 1.244835 -1.089347
C  2.872595 -0.505757 0.270162
C  2.556913 1.422125 -1.199729
C  3.428302 0.543821 -0.514865
C  4.228286 -2.522054 0.16607
C  5.752157 1.001937 1.094342
H  -4.078595 -2.235444 -1.234096
H  -4.196402 -2.357003 0.522188
H  -4.216139 1.960371 1.440135
H  -4.608491 2.029357 -0.27838
H  -5.618785 -0.332875 -1.331622
H  -6.364825 -1.478867 -0.193625
H  -5.401447 -0.166281 1.749221
H  -6.481027 0.831076 0.746856
H  1.076935 -1.428242 1.04292
H  2.951658 2.236684 -1.812511
H  4.86345 -2.133268 -0.650982
H  3.396697 -3.124324 -0.246166
H  4.829329 -3.132172 0.857153
H  6.851802 1.05976 1.091324
H  5.406456 0.13604 1.675801
H  5.320796 1.9374 1.479543
