program: Gaussian 09
title: 000178110
version: EM64L-G09RevD.01
frameworkgroup: C1[X(C13H13ClN2O2)]
method: RPBEPBE
basis: SDD
operation: Freq
keyword: #p
keyword: freq=noraman
keyword: PBEPBE/SDD
title: #p freq=noraman PBEPBE/SDD
converged: YES YES NO NO
title: Mulliken charges:
elementType: Cl O O N N C C C C C C C C C C C C C H H H H H H H H H H H H H
charge: -0.042239 -0.271687 -0.228034 -0.163895 -0.413370 -0.052368 -0.439587 -0.516362 -0.448723 -0.550069 0.167727 0.152038 0.126976 0.345722 -0.299594 -0.389857 -0.140326 -0.204690 0.267536 0.262782 0.212599 0.245788 0.234402 0.233201 0.217515 0.278253 0.281527 0.330754 0.299880 0.241500 0.262601
chargesum: 0.00000
title: Mulliken charges with hydrogens summed into heavy atoms:
elementType: Cl O O N N C C C C C C C C C C C C C
charge: -0.042239 -0.271687 -0.228034 -0.163895 -0.082617 0.215169 0.035795 -0.036172 0.001992 0.009712 0.167727 0.152038 0.126976 0.345722 0.000286 -0.148357 -0.140326 0.057910
polarizability: 2.51535577e+02 -1.63667966e+01 1.68759889e+02 -5.18025950e+00 -5.56182805e+00 9.64768342e+01
1716.lowfreq: -6.7278 0.0022 0.0022 0.0023 5.4869 10.9277 29.6246 50.5581 61.9341
frequency: 29.2208 50.5474 61.9233 74.7614 116.5190 146.2961 156.2596 174.4696 178.7018 267.6287 276.5862 295.3874 320.3496 346.2521 361.4877 386.4796 405.7931 453.4066 478.2135 511.7469 532.1686 548.1588 571.0918 617.8104 660.2405 677.7988 696.9788 711.3248 757.3718 765.7239 786.4182 796.6305 819.4074 847.9318 884.2743 903.3475 914.4541 932.7528 937.1571 949.9900 950.9597 977.2921 1023.8473 1055.0048 1086.0806 1116.8913 1119.9250 1147.2346 1167.2786 1188.0611 1207.8145 1219.8340 1226.6289 1230.4405 1242.3292 1253.2022 1256.1274 1268.5926 1308.1064 1339.6680 1345.0212 1352.5258 1385.7056 1396.8184 1443.4806 1455.8760 1465.9205 1468.0056 1469.8139 1481.9862 1550.6503 1575.6698 1605.4803 1640.3221 2995.9074 2999.2341 3013.9583 3028.5752 3034.4614 3086.0879 3104.5013 3128.5046 3130.6524 3134.5181 3171.9374 3176.5538 3503.3860
redmass: 3.4429 4.5807 7.1674 4.9252 6.5845 4.0457 7.6901 2.6544 5.9099 4.7940 6.5148 8.6132 5.4279 5.7710 4.4811 4.8328 3.1416 5.2013 3.4604 3.8048 3.1255 2.9328 3.5433 4.6117 3.5492 3.5130 3.3238 2.2112 4.1171 1.9304 2.1766 1.7279 1.5558 4.5844 2.5523 4.0111 1.5444 2.5332 2.4113 1.3664 1.3665 2.0716 3.0962 2.6879 2.0471 2.3650 2.5801 1.5622 1.3979 1.8005 1.4211 1.2579 2.2531 1.3666 1.6951 1.5319 1.4258 1.8708 2.1599 1.4916 2.1090 2.1094 5.8166 2.6048 2.5546 1.0894 1.0902 1.7519 1.4121 1.1276 9.3124 8.3137 7.0118 5.4331 1.0731 1.0815 1.0583 1.0603 1.0653 1.1074 1.1065 1.1053 1.0942 1.0901 1.0923 1.0960 1.0756
irintensity: 0.3218 1.4725 0.3627 4.0746 0.6620 0.8648 2.1543 2.3120 1.3644 1.8952 6.6889 2.8715 5.2083 2.5245 2.8042 7.1250 0.3752 14.7495 1.7121 17.3977 17.7259 20.4541 3.7868 4.3105 14.3425 25.8998 50.9848 27.2600 6.6517 2.1497 9.3828 0.0416 60.6238 18.7317 15.8908 6.2567 11.1992 4.3537 0.9903 1.5648 2.2128 19.9797 1.3290 4.5722 12.3162 10.9318 8.4522 42.1669 20.0688 69.1464 20.1719 4.2195 7.5229 0.6715 51.9404 7.4220 15.2827 7.8654 7.2872 4.9382 125.0396 4.2147 12.5270 145.8134 47.1753 9.9176 4.7304 82.1865 78.3562 6.6886 168.7333 70.0976 5.4283 476.0643 16.2824 18.8537 26.3949 55.2346 12.9103 22.7073 31.7045 30.2495 2.6350 7.9270 3.4130 3.5856 28.8815
temp: 298.150 k
press: 1.00000 atm
elementType: 17 8 8 7 7 6 6 6 6 6 6 6 6 6 6 6 6 6 1 1 1 1 1 1 1 1 1 1 1 1 1
symmnumber: 1
zpe: 627644.3 jmol-1
zpe.correction: 0.239057 hartree
zpe.thermalcorrener: 0.254641 hartree
zpe.thermalcorrenthalpy: 0.255585 hartree
zpe.thermalcorrgfe: 0.194991 hartree
zpe.sumelectzpe: -1221.892642 hartree
zpe.sumelectthermal: -1221.877058 hartree
zpe.sumelectthermalent: -1221.876114 hartree
zpe.sumelectthermalfe: -1221.936708 hartree
dipole: -0.0858 2.4199 0.9960
dipole: 2.6182
quadrupole: -112.1121 -119.4856 -108.9963
quadrupole: 17.2677 -4.5410 -4.5464
quadrupole: 1.4192 -5.9543 4.5350 17.2677 -4.5410 -4.5464
hfenergy: -1222.1316989 hartree
pointgroup: C01 [X(C13H13Cl1N2O2)]
dipole: -0.0192772 0.9810531 -0.3134229 debye
polarizability: 249.0745636|21.7159506|169.9522408|1.3011882|11.9681416|97.745496 unknown
InChI: InChI=1S/C13H13ClN2O2/c14-8-4-5-11-10(6-8)13(18)16(7-12(17)15-11)9-2-1-3-9/h4-6,9,15H,1-3,7H2
charge 0 multiplicity 1
31 atoms
Cl -5.02774 -1.665551 -0.508512
O  0.22326 -2.276072 0.093488
O  1.76159 2.981166 0.362718
N  1.300674 -0.306818 -0.496662
N  -0.304826 1.958141 0.63873
C  2.608272 -1.004183 -0.416594
C  3.057557 -1.594299 0.962336
C  3.917716 -0.1484 -0.445699
C  4.518132 -1.146632 0.607765
C  1.206051 1.046586 -1.07428
C  0.164346 -1.028265 -0.160079
C  -1.159372 -0.298475 -0.094974
C  0.940799 2.084854 0.01966
C  -1.360294 1.0560 0.320589
C  -2.298044 -1.113327 -0.337896
C  -2.686517 1.541751 0.495451
C  -3.58995 -0.599977 -0.178158
C  -3.804558 0.727304 0.249971
H  2.632522 -1.80139 -1.184545
H  2.854404 -2.660929 1.12894
H  2.641478 -1.00641 1.799145
H  3.769205 0.850002 0.002974
H  4.435992 -0.041745 -1.412783
H  5.120367 -0.703798 1.415799
H  5.096383 -1.956453 0.130493
H  2.155866 1.308851 -1.5585
H  0.403573 1.086293 -1.835854
H  -0.511228 2.694179 1.322336
H  -2.125785 -2.158893 -0.608678
H  -2.8387 2.578628 0.816972
H  -4.818275 1.11496 0.383445
