program: Gaussian 09
title: 000178259
version: EM64L-G09RevD.01
frameworkgroup: C1[X(C23H32O4)]
method: RPBEPBE
basis: SDD
operation: Freq
keyword: #pfreq=noraman
keyword: PBEPBE/SDD
title: #p freq=noraman PBEPBE/SDD
converged: YES YES NO NO
title: Mulliken charges:
elementType: O O O O C C C C C C C C C C C C C C C C C C C C C C C H H H H H H H H H H H H H H H H H H H H H H H H H H H H H H H H
charge: -0.468453 -0.317870 -0.265147 -0.259983 0.273636 0.180666 -0.056218 -0.532555 -0.508113 -0.549137 -0.142375 -0.074584 -0.778432 -0.510349 -0.393373 0.452995 -0.728327 -0.737705 -0.832773 0.202994 0.219708 -0.353833 -0.309662 -0.350168 -0.347951 0.334172 -0.537404 0.214850 0.217044 0.237473 0.225364 0.210292 0.218869 0.243569 0.254607 0.206537 0.198423 0.238795 0.243777 0.240197 0.196655 0.328214 0.233674 0.213845 0.217409 0.197781 0.208053 0.236036 0.208296 0.223181 0.224468 0.233895 0.269192 0.253792 0.244765 0.252429 0.247947 0.225334 0.225478
chargesum: 0.00000
title: Mulliken charges with hydrogens summed into heavy atoms:
elementType: O O O O C C C C C C C C C C C C C C C C C C C C C C C
charge: -0.140239 -0.317870 -0.265147 -0.259983 0.273636 0.180666 0.158632 -0.078038 -0.072457 -0.086699 0.112232 0.131953 -0.097437 -0.073497 -0.159699 0.452995 -0.099293 -0.085320 -0.151229 0.202994 0.219708 -0.084641 -0.055869 -0.105403 -0.095522 0.334172 0.161355
polarizability: 3.29487532e+02 2.14211995e+01 2.59455273e+02 -4.67265396e+00 1.70135861e+01 2.15312234e+02
1716.lowfreq: -7.4910 -0.0003 0.0005 0.0008 2.7983 7.3460 18.5260 18.8362 29.0247
frequency: 17.2783 18.5172 28.8410 47.3339 52.6932 61.1562 84.8739 88.0562 116.8556 123.9145 136.9154 151.0281 174.0173 177.0794 189.4817 204.8477 218.6341 221.2713 228.3115 235.1125 251.7246 256.8220 279.6188 286.0987 299.0409 309.3449 311.1713 321.5223 335.6428 339.2697 346.4796 360.9044 376.2584 400.1247 416.2541 420.1437 432.1405 453.6611 478.4331 493.6353 504.9343 511.4669 524.5446 559.1523 566.6230 603.9513 612.4297 628.7670 672.0756 675.8226 710.1793 752.8322 754.6995 758.9779 801.1899 809.0391 823.8343 824.7599 837.5117 848.1713 859.9556 880.8016 893.5020 907.4675 914.7284 916.7369 939.9822 955.1207 960.8229 973.3714 981.9775 983.3625 985.5064 990.3034 996.7635 998.1314 1030.5005 1039.4614 1044.5907 1055.7849 1076.4893 1084.7331 1099.4060 1107.9594 1110.8621 1112.9431 1133.6767 1146.7240 1155.3939 1157.7247 1166.2930 1169.3325 1171.9551 1181.3479 1201.6273 1218.7569 1231.8021 1235.8901 1237.7121 1250.3639 1264.0621 1282.4027 1296.8907 1305.9824 1313.0941 1321.7308 1326.4555 1329.1007 1331.8767 1340.2720 1349.5747 1356.3910 1378.4693 1379.0494 1383.8064 1392.4469 1394.7629 1398.9559 1425.8796 1437.3612 1452.3185 1460.7947 1461.9932 1465.0915 1467.2613 1468.5616 1469.6038 1470.9223 1471.8155 1473.6672 1475.0713 1478.0788 1486.3156 1494.9119 1496.7463 1571.9982 1605.8464 1620.3418 1690.3130 2949.8338 2953.3373 2960.8934 2966.0856 2966.4012 2969.3132 2973.4446 2987.7571 2990.2997 2996.5674 3003.1309 3013.3092 3019.0033 3031.3463 3053.1291 3056.6107 3057.7945 3059.7178 3067.7359 3070.2976 3072.1770 3084.3597 3087.0728 3088.1913 3108.8172 3118.4945 3130.5633 3149.2238 3158.0755 3169.0168 3179.2398 3549.4011
redmass: 3.9872 4.7484 3.7201 3.0287 3.6641 4.5836 3.3797 4.6742 3.1635 3.3092 4.0794 2.7944 1.6707 1.8720 1.9832 2.2581 1.5625 2.6421 1.4955 1.6165 1.4824 1.6950 2.7359 3.0864 2.8464 4.5278 3.0460 1.5450 2.2512 3.0772 2.3375 2.7527 3.5921 2.6198 2.9688 2.9176 2.5094 2.7169 2.7389 3.8568 2.9602 3.0711 3.0923 4.8669 3.4062 3.7659 3.2128 6.7361 3.2612 3.6408 4.1207 4.7084 5.1489 3.2646 3.0302 4.6027 2.7603 1.3181 1.8378 1.7032 2.1853 2.4667 2.2192 2.1846 1.3048 2.2023 1.8606 1.5497 1.4394 1.3583 1.3556 6.0733 2.0291 1.6882 1.8162 3.0025 2.2722 1.6132 2.9947 3.3643 2.1887 1.8695 2.8354 2.1060 1.3175 1.2587 2.4068 2.3522 1.3253 2.2385 1.5470 1.2542 1.7772 1.8992 1.8665 1.5019 2.4393 1.5038 2.1485 3.1549 1.4544 1.4099 1.2957 1.4170 1.3956 1.3408 1.3649 1.3932 1.3902 1.4165 1.3914 1.4061 1.2188 5.3910 1.6384 1.2302 1.2171 1.2205 4.2021 1.1905 1.0744 1.0684 1.0524 1.0742 1.0679 1.0498 1.0646 1.0597 1.0797 1.0619 1.0577 1.0812 1.0602 1.0501 2.4820 8.1441 10.1155 6.5754 6.6161 1.0803 1.0585 1.0405 1.0374 1.0753 1.0375 1.0388 1.0417 1.0611 1.0900 1.0630 1.0824 1.0666 1.0964 1.1010 1.1042 1.0991 1.0988 1.0992 1.1023 1.0995 1.0982 1.0936 1.0976 1.0899 1.0996 1.0998 1.0879 1.0880 1.0960 1.0971 1.0652
irintensity: 0.0730 0.0276 0.6297 0.5299 0.9652 2.0215 0.5113 0.0193 1.1924 1.5052 4.5402 1.7663 0.7884 0.1309 0.6382 2.2171 0.5749 6.9163 1.4048 1.9963 2.3449 3.3025 0.9302 3.8829 0.1194 3.2521 7.6983 80.1116 28.7977 4.6843 7.9255 3.4661 3.0083 1.6319 0.1294 12.9734 9.4492 2.1256 0.0933 0.1464 7.1769 0.6967 9.2786 5.0883 19.0871 5.4882 2.8798 3.6659 10.3054 13.2855 13.3326 23.1105 30.2550 19.4236 13.8585 37.6249 1.0892 3.7959 0.9289 55.9831 15.2589 45.1154 40.1727 2.1789 9.8083 71.5522 10.9436 1.7937 3.9163 0.2839 1.1139 135.3418 35.9718 33.9577 53.1634 15.6795 6.5708 6.1392 149.2041 146.7052 4.1728 4.0048 2.7460 10.3288 9.0449 0.1783 3.8021 11.3143 11.5352 17.4053 17.0068 213.3014 8.4428 12.2743 5.3126 5.6173 24.7432 39.8221 59.7923 466.0338 8.9110 5.1243 5.7170 29.2537 11.4137 5.0761 7.7906 4.6078 1.4208 7.5458 1.3733 4.8024 14.7833 24.7372 16.0378 23.4638 30.3364 2.0545 0.6168 10.0352 10.3469 5.6490 14.2904 5.3421 23.1639 14.2811 15.5120 3.9547 57.3159 3.0139 3.9010 4.0856 3.2643 33.8451 54.0388 8.7468 231.9019 174.4195 19.4530 1.1063 11.7646 68.2006 93.3996 8.3560 30.8836 32.7857 24.4647 47.0620 11.7621 27.5429 29.0322 38.2846 24.0165 12.7544 42.4650 22.5570 41.3011 67.8743 31.0265 67.4233 21.5927 21.6756 34.8860 19.4845 24.6563 23.5707 2.0809 3.0460 14.9806 4.2436 2.4367
temp: 298.150 k
press: 1.00000 atm
elementType: 8 8 8 8 6 6 6 6 6 6 6 6 6 6 6 6 6 6 6 6 6 6 6 6 6 6 6 1 1 1 1 1 1 1 1 1 1 1 1 1 1 1 1 1 1 1 1 1 1 1 1 1 1 1 1 1 1 1 1
symmnumber: 1
zpe: 1314194.7 jmol-1
zpe.correction: 0.500550 hartree
zpe.thermalcorrener: 0.528430 hartree
zpe.thermalcorrenthalpy: 0.529375 hartree
zpe.thermalcorrgfe: 0.442148 hartree
zpe.sumelectzpe: -1194.455832 hartree
zpe.sumelectthermal: -1194.427952 hartree
zpe.sumelectthermalent: -1194.427008 hartree
zpe.sumelectthermalfe: -1194.514234 hartree
dipole: 2.2687 1.8541 2.1063
dipole: 3.6085
quadrupole: -132.4073 -164.1878 -162.7671
quadrupole: -2.1940 -6.4227 -3.0697
quadrupole: 20.7134 -11.0671 -9.6464 -2.1940 -6.4227 -3.0697
hfenergy: -1194.9563824 hartree
pointgroup: C01 [X(C23H32O4)]
dipole: 0.9087778 -0.6909076 -0.8439819 debye
polarizability: 329.6330031|-21.3910765|257.7909644|5.2829974|18.4115419|216.831072 unknown
InChI: InChI=1S/C23H32O4/c1-15(2)19-11-12-22(4)20(14-16(3)10-13-23(19,22)25)27-21(24)17-6-8-18(26-5)9-7-17/h6-9,14-15,19-20,25H,10-13H2,1-5H3
charge 0 multiplicity 1
59 atoms
O  -4.043144 -0.830375 -0.291436
O  0.026782 0.847579 0.415427
O  1.176851 2.519824 1.575022
O  5.95624 -1.154307 -0.870694
C  -2.352478 0.390842 1.025199
C  -2.571878 -0.575804 -0.22591
C  -1.847107 -1.923536 0.160183
C  -1.845419 -0.543766 2.182008
C  -2.054896 -1.989928 1.696803
C  -2.124252 0.033048 -1.576681
C  -1.293835 1.513689 0.81307
C  -2.309024 -3.242567 -0.538215
C  -3.666554 1.093942 1.464603
C  -2.820457 1.362524 -1.951093
C  -1.582843 2.658915 -0.131863
C  -2.251188 2.622986 -1.319081
C  -2.210018 -3.254494 -2.086623
C  -1.496308 -4.445347 0.013506
C  -2.481031 3.897828 -2.111688
C  1.189489 1.480478 0.863008
C  2.4226 0.783683 0.40507
C  3.676152 1.308456 0.806354
C  2.390084 -0.37875 -0.414608
C  4.880511 0.697817 0.407018
C  3.58203 -0.996885 -0.820683
C  4.832238 -0.461532 -0.411076
C  7.278106 -0.648733 -0.484736
H  -0.765019 -1.776032 -0.047337
H  -2.380033 -0.332775 3.125638
H  -0.769175 -0.372135 2.364218
H  -1.365274 -2.693662 2.193377
H  -3.09102 -2.325241 1.899531
H  -2.343777 -0.697106 -2.375969
H  -1.029396 0.176793 -1.568435
H  -1.095609 1.955272 1.808569
H  -3.371398 -3.410453 -0.257337
H  -3.460919 1.762074 2.323093
H  -4.110914 1.696297 0.656872
H  -4.410822 0.343113 1.772317
H  -3.901048 1.278532 -1.704928
H  -2.776728 1.489263 -3.051971
H  -4.19837 -1.456486 -1.044265
H  -1.184622 3.62386 0.209226
H  -2.380985 -4.278953 -2.466948
H  -1.20751 -2.932556 -2.427038
H  -2.955902 -2.602892 -2.57795
H  -0.41376 -4.305545 -0.174411
H  -1.637764 -4.579122 1.099143
H  -1.80647 -5.383527 -0.483279
H  -3.559926 4.044019 -2.319108
H  -1.975316 3.847701 -3.096686
H  -2.109645 4.789427 -1.578576
H  3.686063 2.203966 1.436607
H  1.424224 -0.784751 -0.727436
H  5.83475 1.123152 0.730686
H  3.578529 -1.890503 -1.451801
H  7.995128 -1.339409 -0.951349
H  7.406829 -0.661715 0.614595
H  7.442224 0.376708 -0.867834
