program: Gaussian 09
title: 000178096
version: EM64L-G09RevD.01
frameworkgroup: C1[X(C7H10N2)]
method: RPBEPBE
basis: SDD
operation: Freq
keyword: #pfreq=noraman
keyword: PBEPBE/SDD
title: #p freq=noraman PBEPBE/SDD
converged: YES YES NO NO
title: Mulliken charges:
elementType: N N C C C C C C C H H H H H H H H H H
charge: -0.693988 -0.530575 0.338022 0.286316 -0.595258 -0.386570 -0.395282 -0.269890 -0.214391 0.200714 0.233340 0.222920 0.211344 0.223304 0.220417 0.312159 0.300502 0.269523 0.267391
chargesum: 0.00000
title: Mulliken charges with hydrogens summed into heavy atoms:
elementType: N N C C C C C C C
charge: -0.081327 0.006339 0.338022 0.286316 -0.161204 -0.163649 -0.183938 -0.046586 0.006027
polarizability: 1.12201766e+02 -5.69931983e+00 1.00788880e+02 5.58675968e+00 2.30386729e+00 4.93456369e+01
1716.lowfreq: -14.9807 -4.1354 -0.0010 -0.0004 0.0006 5.3335 88.0612 120.2738 199.9783
frequency: 88.0423 120.2564 199.9769 234.1267 326.5484 355.5203 381.6616 405.5191 410.1792 465.0582 517.0872 559.4958 591.2680 694.9845 724.2924 750.9675 767.5599 835.8135 855.9865 876.4975 929.1927 964.8487 1009.1954 1041.1628 1059.1273 1098.1330 1148.0530 1170.8616 1190.9710 1283.8048 1302.8685 1321.9720 1336.5599 1392.8133 1448.1442 1466.9876 1493.7597 1589.4162 1615.4920 1642.5886 1656.0063 2964.5888 3048.2969 3107.8171 3111.6941 3136.2757 3161.1654 3427.0579 3547.6475 3551.0385 3686.9188
redmass: 3.1598 3.7430 2.8739 1.3231 2.3209 2.5180 1.0947 2.2482 1.2626 3.1830 3.7059 4.8013 3.5440 2.0242 2.8682 1.3851 3.0256 1.7835 2.3855 1.5212 1.3977 1.3101 1.8152 1.9351 3.7248 1.3236 1.2288 1.0517 3.1719 2.0623 1.4537 1.3405 1.2814 6.1026 2.5175 1.1635 2.5706 6.6316 4.2306 1.2671 1.0822 1.0678 1.0953 1.0871 1.0888 1.0921 1.1000 1.0453 1.0945 1.0461 1.1027
irintensity: 2.1167 1.1970 9.3658 41.4577 18.2048 13.4761 53.6655 16.5327 230.4506 4.0835 5.3860 1.0174 14.2904 209.8896 22.6548 90.7464 87.0685 15.9445 23.1574 1.4703 3.5591 0.0639 0.9449 5.0864 13.9753 9.6032 13.3754 2.3601 6.5528 13.7554 12.8511 12.3394 0.8240 7.5796 21.1768 10.6704 70.8621 11.3660 18.5858 179.7980 29.7855 60.8270 22.9457 24.3105 5.0126 29.6821 27.4969 1.6834 2.1436 33.8446 16.8384
temp: 298.150 k
press: 1.00000 atm
elementType: 7 7 6 6 6 6 6 6 6 1 1 1 1 1 1 1 1 1 1
symmnumber: 1
zpe: 419083.6 jmol-1
zpe.correction: 0.159621 hartree
zpe.thermalcorrener: 0.168402 hartree
zpe.thermalcorrenthalpy: 0.169347 hartree
zpe.thermalcorrgfe: 0.126530 hartree
zpe.sumelectzpe: -381.569104 hartree
zpe.sumelectthermal: -381.560322 hartree
zpe.sumelectthermalent: -381.559378 hartree
zpe.sumelectthermalfe: -381.602195 hartree
dipole: 0.2701 1.7634 0.0363
dipole: 1.7844
quadrupole: -58.5943 -43.3280 -56.2174
quadrupole: -2.6084 1.7161 -0.9623
quadrupole: -5.8811 9.3852 -3.5042 -2.6084 1.7161 -0.9623
hfenergy: -381.7287243 hartree
pointgroup: C01 [X(C7H10N2)]
dipole: -0.1445806 -0.6835173 0.0687905 debye
dipolederiv: -0.6077759 0.6016236 -0.1678816 0.5257612 -0.9406724 -0.0417916 -0.2661113 0.0707089 -0.6267096 -1.0849165 -0.1057294 -0.102509 -0.0371092 -0.183109 0.0114745 -0.119629 0.010738 -0.4185424 -0.0326887 -0.0569978 -0.0329006 0.322741 -0.300964 -0.0134918 0.008564 0.0647931 -0.1939662 0.3696765 -0.6735033 0.0475555 -0.6838465 0.898262 -0.0097393 0.0678332 0.0045535 0.0792125 0.5683729 0.0821861 0.0239152 0.0182132 0.1937797 0.0068234 0.0301269 0.0186668 0.4523375 0.1504564 0.0019026 -0.0743162 -0.1126747 0.119563 -0.03003 -0.059333 -0.0447173 -0.1317317 -0.1635775 0.3965033 -0.0526329 -0.0065144 -0.0611787 -0.0259501 0.0131876 -0.1200554 -0.2037209 -0.2193985 -0.0833489 0.007193 -0.1170029 -0.1242961 -0.0006334 0.0346096 -0.0047902 -0.2145556 0.0730035 -0.0787347 -0.0442338 0.1067002 0.201652 -0.0593284 -0.0543711 -0.0415412 -0.126502 -0.0484329 0.028844 0.0374963 0.0956769 -0.042467 -0.1723378 0.0208932 -0.0932162 -0.0566675 0.0329437 0.0038548 -0.0254046 -0.0720153 -0.1052084 0.1248591 -0.0036887 0.0552105 0.0305889 0.046059 -0.1060318 0.0379271 -0.0667841 -0.0858052 0.0466041 0.0250033 0.0514926 0.1257425 0.0461207 -0.0451942 0.0222877 -0.0806319 -0.132541 0.0503715 0.0273862 0.0496105 0.1535242 -0.0083462 0.1051736 0.0105392 0.1165302 -0.0558703 0.0191537 0.0135655 0.021649 0.1702101 -0.1359717 -0.0202567 0.052242 -0.0284703 0.0888998 0.0149652 0.0532268 0.0170795 0.1435453 0.1720931 -0.0369855 0.0730251 0.0051888 0.1961123 0.0431856 0.1334664 -0.0204687 0.2984864 0.1419988 -0.0601599 0.0523117 -0.0312752 0.1704154 0.0175251 0.0648533 -0.0296175 0.3515917 0.3827769 -0.1155065 0.0550535 -0.0462731 0.0494347 0.0784117 0.0082789 0.0577058 0.1040319 0.3176066 0.1623607 0.0803324 0.0917862 0.1139934 -0.0600716 0.0021382 -0.0678019 0.0631249 unknown
polarizability: 111.7162038|-6.6215156|100.7435687|-4.1067014|-6.394072|49.8765102 unknown
InChI: InChI=1S/C7H10N2/c8-5-6-3-1-2-4-7(6)9/h1-4H,5,8-9H2
charge 0 multiplicity 1
19 atoms
N  0.742412 -2.077283 0.031382
N  2.786452 0.426913 0.753018
C  0.460847 0.351118 -0.29076
C  -0.087233 -0.943751 -0.01072
C  1.9667 0.530083 -0.487172
C  -0.411686 1.463225 -0.320649
C  -1.480025 -1.073031 0.25027
C  -1.796617 1.336757 -0.063528
C  -2.323175 0.057098 0.228064
H  2.366051 -0.205725 -1.215486
H  2.162892 1.521888 -0.932316
H  0.009241 2.452022 -0.546541
H  -1.899093 -2.064429 0.466103
H  -2.449978 2.214874 -0.092135
H  -3.393146 -0.064976 0.432535
H  1.676809 -2.04953 -0.368007
H  0.325634 -2.994226 0.171237
H  2.668116 -0.474147 1.233714
H  2.5934 1.196822 1.404791
