program: Gaussian 09
title: 000178104
version: EM64L-G09RevD.01
frameworkgroup: C1[X(C13H15ClN2O2)]
method: RPBEPBE
basis: SDD
operation: Freq
keyword: #p
keyword: freq=noraman
keyword: PBEPBE/SDD
title: #p freq=noraman PBEPBE/SDD
converged: YES YES NO NO
title: Mulliken charges:
elementType: Cl O O N N C C C C C C C C C C C C C H H H H H H H H H H H H H H H
charge: -0.043894 -0.284406 -0.228186 -0.186654 -0.410179 0.317737 -0.559536 -0.711659 -0.767711 -0.695132 0.191688 0.154175 0.125774 0.341247 -0.305381 -0.388635 -0.138657 -0.205479 0.276247 0.287312 0.215947 0.209511 0.278147 0.210100 0.263082 0.231943 0.277492 0.207518 0.205825 0.329506 0.297806 0.241992 0.262458
chargesum: 0.00000
title: Mulliken charges with hydrogens summed into heavy atoms:
elementType: Cl O O N N C C C C C C C C C C C C C
charge: -0.043894 -0.284406 -0.228186 -0.186654 -0.080673 0.317737 0.004023 -0.008053 -0.062586 -0.004297 0.191688 0.154175 0.125774 0.341247 -0.007574 -0.146643 -0.138657 0.056978
polarizability: 2.47678956e+02 -1.39853730e+01 1.74474269e+02 2.77324301e+00 3.93663003e+00 1.00263943e+02
1716.lowfreq: -7.9991 -2.1866 -0.0021 -0.0015 0.0012 9.3793 39.1905 52.6301 64.1097
frequency: 39.0347 52.5811 64.1006 97.3892 130.7905 158.3878 169.1161 191.2199 219.8381 237.8803 247.4098 292.0612 304.2701 307.8203 316.5558 338.6231 357.5742 368.0907 387.0015 419.9462 440.4662 448.1614 466.9861 475.4371 517.2277 528.2140 555.9090 576.6234 641.4263 670.6753 683.0636 697.6387 748.2247 760.2902 787.2806 816.6318 837.6654 862.3034 903.4697 910.3037 918.9124 928.0177 948.8770 957.0947 974.0800 1030.2099 1036.3111 1076.6246 1093.7966 1128.0221 1163.4920 1189.8208 1219.3112 1229.0921 1239.0550 1255.4419 1257.0573 1302.0220 1337.9516 1345.1724 1373.0196 1374.0057 1382.9524 1389.4603 1408.1607 1441.6193 1450.3207 1457.8254 1468.2628 1469.6352 1479.0472 1489.7497 1494.9936 1509.5905 1554.6285 1575.1137 1604.7221 1639.9044 2979.7656 2984.2224 2990.7480 3007.1040 3072.4213 3077.2693 3080.6676 3090.5315 3115.7343 3118.7830 3134.5193 3154.8346 3174.3639 3176.4932 3505.0314
redmass: 4.1504 3.9731 9.3850 4.3811 7.1064 7.5062 5.4002 1.4223 3.1014 2.0715 1.2289 5.3264 6.7216 3.8627 3.8068 1.0686 5.9721 2.8721 3.6040 2.9648 2.6495 4.5266 3.8554 3.2273 3.6161 3.6495 3.0366 3.7071 5.8130 5.3368 1.9664 3.6698 4.8619 4.1984 5.0511 1.5961 3.3262 3.9982 3.8766 1.6028 1.7099 1.6392 1.3581 1.1998 2.3381 1.4382 1.3971 2.3943 2.8551 1.8860 2.4805 1.8280 2.2615 2.8884 2.1091 2.8628 1.5230 2.6809 1.6932 2.7218 1.5184 1.9493 1.3660 3.5245 1.2189 2.5124 1.0487 1.0916 2.0480 1.2461 1.0492 1.0607 1.0520 1.0821 6.4916 7.7766 6.9511 5.5050 1.0366 1.0366 1.0372 1.0709 1.0997 1.0991 1.1000 1.0992 1.0990 1.0987 1.0900 1.0917 1.0924 1.0957 1.0758
irintensity: 0.9408 1.6564 1.3422 2.6661 1.1057 4.2463 0.1626 0.1565 2.7811 0.9601 0.4133 2.0476 2.2711 1.6891 2.8899 0.0413 4.4254 5.2920 6.9376 0.6166 3.6822 7.9595 18.2964 2.9087 7.9540 17.2768 17.6419 2.7080 2.4903 9.5233 55.6533 43.8790 10.7418 5.5978 4.6734 57.5783 11.0603 28.5673 6.2365 11.3062 0.6704 3.5808 1.2527 0.6793 21.1116 1.3149 0.8134 12.6793 16.2169 61.6210 9.8271 224.2490 15.2026 8.4319 28.6249 7.1763 11.4063 2.3060 22.4623 71.2622 78.2697 82.7014 39.4756 71.2713 20.8175 35.6151 0.7626 17.7064 153.5639 19.7966 1.9864 22.5532 13.9836 28.9881 128.2485 55.0196 7.2420 480.3185 12.0572 41.0125 27.3203 17.8155 1.0143 39.7569 34.5777 46.8918 1.1496 10.5128 7.7893 2.2214 1.5788 4.9114 29.4388
temp: 298.150 k
press: 1.00000 atm
elementType: 17 8 8 7 7 6 6 6 6 6 6 6 6 6 6 6 6 6 1 1 1 1 1 1 1 1 1 1 1 1 1 1 1
symmnumber: 1
zpe: 681174.9 jmol-1
zpe.correction: 0.259446 hartree
zpe.thermalcorrener: 0.276351 hartree
zpe.thermalcorrenthalpy: 0.277295 hartree
zpe.thermalcorrgfe: 0.215301 hartree
zpe.sumelectzpe: -1223.094574 hartree
zpe.sumelectthermal: -1223.077669 hartree
zpe.sumelectthermalent: -1223.076724 hartree
zpe.sumelectthermalfe: -1223.138719 hartree
dipole: -0.2024 2.1556 -1.2368
dipole: 2.4934
quadrupole: -113.1506 -119.6132 -112.5602
quadrupole: 17.8221 3.1218 4.7964
quadrupole: 1.9574 -4.5052 2.5478 17.8221 3.1218 4.7964
hfenergy: -1223.3540198 hartree
pointgroup: C01 [X(C13H15Cl1N2O2)]
dipole: 0.0210223 0.8465833 0.4951589 debye
polarizability: 245.3828602|18.9137113|176.8486629|2.9889742|-2.9887421|100.1856449 unknown
InChI: InChI=1S/C13H15ClN2O2/c1-13(2,3)16-7-11(17)15-10-5-4-8(14)6-9(10)12(16)18/h4-6,15H,7H2,1-3H3
charge 0 multiplicity 1
33 atoms
Cl -4.887918 -1.703386 0.286219
O  0.299638 -2.134868 -0.690198
O  1.86785 3.028423 0.086236
N  1.438584 -0.350041 0.321455
N  -0.208655 2.090486 -0.37087
C  2.822779 -0.930081 0.012162
C  1.284786 0.86846 1.146011
C  2.969365 -1.079622 -1.527075
C  3.9390 0.020241 0.513362
C  2.963974 -2.302588 0.723955
C  0.291072 -0.980345 -0.148299
C  -1.038051 -0.25615 -0.015062
C  1.036585 2.093404 0.260772
C  -1.259114 1.145232 -0.198474
C  -2.166074 -1.10902 0.125059
C  -2.590413 1.642901 -0.263198
C  -3.463967 -0.586405 0.086524
C  -3.697507 0.789477 -0.122048
H  2.194387 1.055927 1.726354
H  0.446736 0.737692 1.856005
H  2.909778 -0.092163 -2.019962
H  3.956338 -1.520587 -1.756608
H  2.190642 -1.738127 -1.940351
H  4.00611 0.053583 1.616402
H  3.826634 1.048566 0.125899
H  4.902042 -0.374767 0.145447
H  2.212536 -3.014323 0.34914
H  3.972324 -2.713987 0.533533
H  2.838685 -2.189742 1.816682
H  -0.416164 2.935711 -0.912946
H  -1.986171 -2.183809 0.214905
H  -2.754882 2.716652 -0.410172
H  -4.716629 1.183356 -0.16586
