program: Gaussian 09
title: 000178140
version: EM64L-G09RevD.01
frameworkgroup: C1[X(C14H17N3O5S)]
method: RPBEPBE
basis: SDD
operation: Freq
keyword: #p
keyword: freq=noraman
keyword: PBEPBE/SDD
title: #p freq=noraman PBEPBE/SDD
converged: YES YES NO NO
title: Mulliken charges:
elementType: S O O O O O N N N C C C C C C C C C C C C C C H H H H H H H H H H H H H H H H H
charge: 0.932687 -0.542358 -0.489974 -0.210768 -0.329766 -0.242891 -0.566249 -0.453634 -0.066058 -0.072390 0.515938 -0.170468 -0.232701 -0.343243 -0.433927 0.244415 -0.496080 0.134340 0.388988 -0.341465 -0.754878 -0.196688 -0.676758 0.295606 0.289117 0.325324 0.317443 0.239673 0.368355 0.268888 0.234898 0.234617 0.256899 0.253214 0.241126 0.201508 0.201858 0.215160 0.230260 0.229982
chargesum: 0.00000
title: Mulliken charges with hydrogens summed into heavy atoms:
elementType: S O O O O O N N N C C C C C C C C C C C C C C
charge: 0.932687 -0.542358 -0.489974 -0.210768 -0.329766 -0.242891 -0.240924 -0.085279 -0.066058 -0.072390 0.515938 0.125137 0.056416 -0.025800 -0.194254 0.244415 -0.227192 0.134340 0.388988 0.128051 -0.003639 0.206677 -0.001355
polarizability: 3.42920589e+02 -4.76560018e+00 2.29916583e+02 -2.86457983e+00 -2.07200183e+01 1.40705504e+02
1716.lowfreq: -12.6197 -4.0169 -1.5661 0.0007 0.0008 0.0012 7.6865 19.1710 27.9588
frequency: -7.5255 18.7528 27.6271 30.6106 38.3037 51.2849 55.4448 76.5687 79.6848 90.4809 101.1645 111.3017 129.5018 166.3155 176.0481 179.5582 198.6762 199.2136 239.3575 241.6817 268.4788 294.8619 320.0671 332.9393 349.3775 373.7049 384.8551 409.3066 410.4612 435.5976 440.5570 492.1787 525.4553 559.4444 580.3171 585.4521 611.3029 618.6715 672.2463 686.3408 726.1310 730.9642 747.3126 789.8907 809.6347 814.7112 816.9092 830.1391 841.5371 857.8382 862.5075 865.1995 924.2885 939.7316 952.0890 967.5820 985.6717 988.9791 997.6979 1000.7954 1003.3091 1006.8850 1048.9958 1051.8697 1070.1277 1114.6136 1125.2886 1139.3060 1141.8025 1185.8017 1188.0358 1191.2742 1211.5720 1255.0637 1255.6903 1270.8089 1306.6740 1316.9276 1381.9161 1382.6453 1398.0978 1404.2815 1410.3423 1410.4775 1437.5141 1453.4532 1455.5153 1462.7594 1469.1044 1477.5019 1479.9006 1491.9561 1526.6044 1593.7140 1600.0632 1605.5533 1633.1723 2941.2657 2956.0271 2994.2791 2995.5896 2996.4489 3009.4491 3077.5036 3095.2409 3102.9025 3113.9837 3133.9522 3167.4733 3169.5306 3194.2029 3241.9015 3420.0977 3439.1896
redmass: 4.3462 4.3075 2.3931 4.3912 4.2369 4.4603 4.6013 1.6882 5.6082 2.1404 6.3787 7.3282 2.5300 5.6064 7.8763 4.4145 6.7155 9.3824 5.1292 1.1403 5.5045 4.3635 8.5132 4.8471 5.4342 7.6547 5.2755 6.3166 3.2515 2.3226 7.2551 4.9384 2.9149 5.0243 5.8448 3.2666 5.1176 6.7723 3.5338 5.4701 3.3139 3.8026 2.6637 1.1572 9.4631 1.0874 1.4443 4.7906 1.2674 1.7773 4.7165 3.0432 4.4654 6.1104 12.8513 1.3633 3.6866 1.5565 2.7965 1.8559 2.5164 3.6950 1.4954 2.3911 5.5369 2.1782 1.3224 1.4340 1.9459 1.1420 1.0893 1.8308 3.5553 1.1414 1.9549 1.8865 1.3993 1.2425 3.6958 1.4909 1.3350 1.2731 4.0279 3.4426 5.3472 1.0954 1.0424 1.0406 1.1299 1.8506 1.1597 1.1142 2.2951 6.3793 5.1270 6.5633 5.9567 1.0555 1.0553 1.1073 1.0373 1.0360 1.1054 1.0981 1.0990 1.1014 1.0989 1.0900 1.0952 1.0917 1.0960 1.0999 1.0765 1.0766
irintensity: 0.1067 4.4600 1.4011 2.1612 7.0730 1.5549 0.9242 0.3336 0.5902 3.0071 1.2174 3.6665 13.1746 3.3563 1.8026 2.2972 1.6081 1.2808 6.0813 0.4696 31.7885 3.6241 28.1055 21.7813 5.5849 9.0864 4.8031 14.7226 2.5165 62.6081 65.9618 22.6259 60.9029 58.3480 1.5269 1.4807 10.7124 8.1792 39.8626 7.5362 29.3368 32.5186 106.5467 27.5197 81.5471 4.7433 66.2837 2.2895 13.0717 116.4764 7.3490 27.0957 8.1540 3.8557 68.1819 1.9393 3.2696 3.1797 3.6907 1.8440 17.2647 16.7640 9.0813 57.7713 230.6726 28.8129 8.5873 5.1672 5.6436 31.5853 5.6257 1.0387 13.5884 0.2860 32.7635 7.5000 14.9520 28.7608 75.4914 80.5401 33.7186 4.3975 23.7367 74.8614 69.6069 14.7133 16.5264 12.9771 39.2105 5.8974 25.1806 14.4321 729.8166 172.7255 21.2397 85.0209 160.0269 64.0125 46.6763 53.6258 16.8043 16.4506 17.8678 8.3526 36.2296 35.7780 9.7974 10.3408 4.6847 11.4158 6.6733 0.7490 186.2531 30.5425
temp: 298.150 k
press: 1.00000 atm
elementType: 16 8 8 8 8 8 7 7 7 6 6 6 6 6 6 6 6 6 6 6 6 6 6 1 1 1 1 1 1 1 1 1 1 1 1 1 1 1 1 1
symmnumber: 1
zpe: 783676.4 jmol-1
zpe.correction: 0.298487 hartree
zpe.thermalcorrener: 0.321948 hartree
zpe.thermalcorrenthalpy: 0.322892 hartree
zpe.thermalcorrgfe: 0.242123 hartree
zpe.sumelectzpe: -1480.193823 hartree
zpe.sumelectthermal: -1480.170362 hartree
zpe.sumelectthermalent: -1480.169418 hartree
zpe.sumelectthermalfe: -1480.250187 hartree
dipole: -4.1517 -0.6216 -4.7080
dipole: 6.3078
quadrupole: -62.0728 -155.2033 -148.0983
quadrupole: -14.0796 -8.5122 -2.6885
quadrupole: 59.7187 -33.4118 -26.3068 -14.0796 -8.5122 -2.6885
hfenergy: -1480.4923094 hartree
pointgroup: C01 [X(C14H17N3O5S1)]
dipole: -1.7956041 -1.3727539 -1.0247591 debye
polarizability: 340.4241074|-21.8749665|164.3428218|-7.4570831|-42.5557472|208.7757472 unknown
InChI: InChI=1S/C14H17N3O5S/c1-3-21-9-14(18)15-11-4-6-12(7-5-11)23(19,20)17-13-8-10(2)22-16-13/h4-8,15,17H,3,9H2,1-2H3
charge 0 multiplicity 1
40 atoms
S  2.305948 1.35003 -1.375915
O  2.25608 2.076197 -2.83324
O  3.101134 2.001808 -0.121257
O  4.250819 -2.016025 1.110196
O  -5.958975 -0.157251 0.017826
O  -3.303555 -0.659712 2.447437
N  3.081218 -0.366654 -1.831352
N  -3.407445 0.081937 0.201715
N  3.21697 -1.304873 0.360239
C  0.561388 0.913555 -0.861969
C  -2.056046 0.347227 -0.115685
C  0.328884 0.439455 0.439285
C  -0.453461 1.111792 -1.81312
C  -0.997584 0.153583 0.817638
C  -1.774657 0.826722 -1.426727
C  3.80899 -1.035331 -0.840775
C  5.158643 -1.550733 -0.917236
C  -3.945069 -0.381702 1.393121
C  5.390598 -2.16111 0.300824
C  -5.471246 -0.545249 1.341266
C  6.547472 -2.885624 0.907855
C  -7.422546 -0.269695 -0.130589
C  -7.782569 0.179406 -1.544826
H  1.158822 0.280652 1.133936
H  -0.212746 1.491237 -2.810759
H  3.586892 -0.188138 -2.71405
H  -1.225617 -0.220348 1.817248
H  -2.59206 0.976462 -2.141635
H  -4.12133 0.242765 -0.523947
H  5.845635 -1.469172 -1.755667
H  -5.714735 -1.604669 1.566535
H  -5.915528 0.08898 2.136808
H  6.872147 -2.394431 1.842354
H  6.277615 -3.92805 1.155461
H  7.397471 -2.901839 0.207553
H  -7.915706 0.370112 0.63229
H  -7.726871 -1.323513 0.046567
H  -8.874426 0.110428 -1.699071
H  -7.473617 1.225505 -1.712139
H  -7.285134 -0.458735 -2.295296
