program: Gaussian 09
title: 000178141
version: EM64L-G09RevD.01
frameworkgroup: C1[X(C16H15ClN4O2S)]
method: RPBEPBE
basis: SDD
operation: Freq
keyword: #p
keyword: freq=noraman
keyword: PBEPBE/SDD
title: #p freq=noraman PBEPBE/SDD
converged: YES YES NO NO
title: Mulliken charges:
elementType: Cl S O O N N N N C C C C C C C C C C C C C C C C H H H H H H H H H H H H H H H
charge: -0.073884 0.889299 -0.541594 -0.518343 -0.257111 -0.492081 -0.083894 -0.684736 0.259422 -0.129366 -0.474159 0.407035 0.240823 -0.190931 -0.208314 -0.263425 -0.400598 -0.760003 -0.388626 -0.387111 0.525522 -0.093492 -0.184355 -0.273914 0.308331 0.269707 0.283220 0.277810 0.346628 0.293728 0.243013 0.231799 0.247107 0.230418 0.230105 0.233693 0.256518 0.316168 0.315587
chargesum: 0.00000
title: Mulliken charges with hydrogens summed into heavy atoms:
elementType: Cl S O O N N N N C C C C C C C C C C C C C C C C
charge: -0.073884 0.889299 -0.541594 -0.518343 -0.257111 -0.183749 -0.083894 -0.052981 0.259422 -0.129366 -0.204452 0.407035 0.240823 0.092289 0.069496 0.083203 -0.106870 -0.038084 -0.158207 -0.157006 0.525522 -0.093492 0.049338 -0.017396
polarizability: 4.12700782e+02 8.21763155e+00 2.62872641e+02 -9.72873491e+00 3.94470986e+01 1.66713331e+02
1716.lowfreq: -72.2907 -6.1107 -3.7773 0.0020 0.0022 0.0028 4.8890 11.0275 18.7586
frequency: -72.2875 10.9673 18.5887 29.8214 40.1223 45.9798 61.4004 97.7161 108.0060 121.0084 135.9417 149.7997 163.5555 182.6156 214.1208 225.3127 233.3144 275.1737 282.9741 307.8127 314.8880 351.3353 359.8615 382.5580 400.8048 408.5867 410.3493 413.7189 422.3169 428.2556 444.9245 446.7155 519.4512 537.7505 570.1471 599.0890 606.4883 621.7334 637.6648 651.9028 684.4414 689.4739 709.0091 715.8901 784.1186 789.0842 797.5133 808.9803 812.9279 827.8812 832.7518 876.8536 908.3627 930.6847 932.8538 953.4521 965.2172 980.2991 981.8804 984.0903 987.2594 994.2842 1023.0168 1031.0622 1046.9504 1049.2868 1072.4174 1089.0204 1127.1129 1132.0586 1142.9241 1168.8046 1174.8515 1184.1036 1271.1941 1292.1926 1299.6522 1324.8283 1334.1914 1380.7105 1393.8332 1400.4526 1404.2428 1424.5672 1438.8767 1446.5930 1463.9362 1473.7644 1487.5369 1489.4145 1521.5497 1576.9283 1581.9492 1605.5127 1614.2686 1649.6032 2994.3739 3077.3668 3105.6732 3134.8088 3136.7676 3146.7136 3161.9667 3164.8855 3175.5241 3179.1172 3195.8300 3229.1489 3348.6309 3561.6386 3700.4167
redmass: 1.0186 6.7778 5.5263 6.0898 4.7322 10.0523 6.4810 5.5692 6.3656 5.9344 6.4681 8.7006 7.5682 5.5575 5.2113 8.1018 4.5475 5.8749 6.3197 5.0401 5.3700 6.0786 4.4070 9.8117 3.1181 3.5222 1.7993 1.5848 4.3677 4.1519 1.7207 3.7727 2.7698 3.5524 5.0312 6.0481 6.2689 6.9068 4.0824 6.8798 3.0006 3.4869 7.5243 2.8934 6.1465 1.5525 5.9177 5.0896 1.2631 1.5248 1.8604 1.5867 1.3561 2.3137 2.0346 1.3494 1.3628 4.9055 6.1476 1.3432 1.6123 4.3901 1.4360 3.5816 1.5018 2.5464 2.0148 1.7861 2.2031 1.3368 1.9196 1.4452 1.2147 1.1174 1.7679 1.8995 1.2954 2.6003 5.5622 9.2917 2.2301 5.1065 1.4373 3.3218 4.0243 2.6897 1.0447 2.8759 1.4356 2.9774 6.2589 7.4530 7.3220 6.8570 4.8498 1.2244 1.0373 1.0981 1.0992 1.0890 1.0889 1.0884 1.0955 1.0968 1.0953 1.0938 1.0953 1.0992 1.0753 1.0453 1.1039
irintensity: 0.2255 2.6548 0.2531 2.1401 0.9258 0.7549 1.2716 2.6078 1.4248 4.0379 0.3866 10.3520 0.1379 0.1756 4.6502 8.4374 2.3950 11.5305 9.9281 4.6478 4.0103 3.2969 3.9364 25.0641 5.9843 1.9587 1.1245 0.2153 47.5637 23.2663 329.1516 58.1979 22.1918 3.3439 1.1781 12.7688 11.8863 0.5301 0.9828 3.3426 2.9139 40.4155 36.6195 3.2865 59.0909 76.0733 30.2990 15.4992 0.5873 25.3660 84.5644 99.0452 0.0645 30.3652 15.5927 3.3232 0.0194 8.7806 7.4166 1.4643 19.9702 13.5251 0.2500 30.3365 7.2709 63.6902 19.4103 7.6428 42.3722 12.1180 23.8516 8.4129 7.8107 50.2676 4.1281 4.8545 4.1228 80.3598 62.1141 1.3868 16.1420 4.1888 17.1466 8.8338 1.0371 69.5285 14.0170 125.9688 14.8920 61.2300 80.7790 37.7895 5.2143 58.5032 225.6799 289.0339 33.9189 13.2800 12.7034 11.4742 12.7816 11.5659 0.9584 13.2496 3.3584 16.4269 2.1263 0.0828 19.0623 143.5423 25.0846
temp: 298.150 k
press: 1.00000 atm
elementType: 17 16 8 8 7 7 7 7 6 6 6 6 6 6 6 6 6 6 6 6 6 6 6 6 1 1 1 1 1 1 1 1 1 1 1 1 1 1 1
symmnumber: 1
zpe: 745335.4 jmol-1
zpe.correction: 0.283883 hartree
zpe.thermalcorrener: 0.306473 hartree
zpe.thermalcorrenthalpy: 0.307417 hartree
zpe.thermalcorrgfe: 0.229056 hartree
zpe.sumelectzpe: -1844.391097 hartree
zpe.sumelectthermal: -1844.368507 hartree
zpe.sumelectthermalent: -1844.367563 hartree
zpe.sumelectthermalfe: -1844.445924 hartree
dipole: 4.0045 3.5537 0.1177
dipole: 5.3553
quadrupole: -106.3721 -166.9730 -153.8699
quadrupole: 3.6615 6.9268 15.4960
quadrupole: 36.0329 -24.5680 -11.4649 3.6615 6.9268 15.4960
hfenergy: -1844.6749798 hartree
pointgroup: C01 [X(C16H15Cl1N4O2S1)]
dipole: -1.3809672 1.5911109 0.0220091 debye
polarizability: 406.4231023|-28.6188139|268.0551685|-24.8498052|-35.970135|167.808484 unknown
InChI: InChI=1S/C10H9ClN3.C6H6NO2S/c1-7-5-10(12)14(13-7)9-4-2-3-8(11)6-9;7-5-1-3-6(4-2-5)10(8)9/h2-6,12H,1H3;1-4H,7H2
charge 0 multiplicity 1
39 atoms
Cl -2.125628 2.658787 1.674457
S  -0.28691 -2.46091 0.015222
O  -0.574448 -3.865691 0.810186
O  0.465606 -2.41131 -1.436194
N  2.324296 0.278836 0.182231
N  0.972015 -1.372572 1.399668
N  3.598273 0.405345 -0.365037
N  -5.476064 0.6076 -0.387174
C  2.154384 -0.988297 0.789705
C  -1.88057 -1.52556 -0.118522
C  3.386474 -1.668982 0.605265
C  1.432167 1.395452 0.075249
C  4.239862 -0.779601 -0.095418
C  -2.025279 -0.573093 -1.145876
C  -2.896763 -1.794725 0.818806
C  0.233805 1.449021 0.83236
C  1.789102 2.468333 -0.782619
C  5.657858 -0.986789 -0.548519
C  -3.234324 0.132788 -1.238491
C  -4.103248 -1.083697 0.722084
C  -4.287001 -0.10147 -0.300087
C  -0.579735 2.585539 0.700559
C  0.942006 3.589258 -0.882168
C  -0.260866 3.667183 -0.140745
H  1.122577 -2.2045 2.005092
H  3.604775 -2.686774 0.922775
H  -1.215275 -0.406106 -1.863034
H  -2.749639 -2.560637 1.586906
H  -0.034514 0.624067 1.494872
H  2.722923 2.4064 -1.344203
H  6.342105 -0.271594 -0.057504
H  5.996977 -2.008157 -0.311268
H  5.748792 -0.836347 -1.638709
H  -3.368664 0.87507 -2.033302
H  -4.909122 -1.281633 1.437978
H  1.219179 4.416604 -1.543797
H  -0.919296 4.536937 -0.213234
H  -5.604947 1.326234 -1.09396
H  -6.222482 0.461193 0.286648
