program: Gaussian 09
title: 000178135
version: EM64L-G09RevD.01
frameworkgroup: C1[X(C24H28N4O2)]
method: RPBEPBE
basis: SDD
operation: Freq
keyword: #p
keyword: freq=noraman
keyword: PBEPBE/SDD
title: #p freq=noraman PBEPBE/SDD
converged: YES YES NO NO
title: Mulliken charges:
elementType: O O N N N N C C C C C C C C C C C C C C C C C C C C C C C C H H H H H H H H H H H H H H H H H H H H H H H H H H H H
charge: -0.250279 -0.243943 -0.065669 -0.456909 -0.054575 -0.407459 -0.216992 -0.444540 -0.455014 -0.387291 -0.361023 0.545618 -0.329374 -0.572540 -0.473020 -0.400425 0.201338 -0.222582 -0.250641 -0.246996 0.486976 0.362872 -0.371977 -0.467140 -0.507317 0.084030 -0.382649 -0.345412 -0.508100 0.200073 0.203141 0.210276 0.212619 0.209071 0.212417 0.172588 0.222183 0.203173 0.172794 0.257486 0.182260 0.259266 0.215528 0.231307 0.230487 0.223561 0.222600 0.227377 0.306600 0.242151 0.247122 0.308299 0.221450 0.260292 0.248911 0.222963 0.276376 0.338660
chargesum: 0.00000
title: Mulliken charges with hydrogens summed into heavy atoms:
elementType: O O N N N N C C C C C C C C C C C C C C C C C C C C C C C C
charge: -0.250279 -0.243943 -0.065669 -0.150309 -0.054575 -0.068799 -0.013851 -0.021646 -0.033526 0.007480 0.014943 0.545618 0.110373 -0.097746 -0.241712 -0.169938 0.201338 0.000979 -0.028041 -0.019619 0.486976 0.362872 -0.063678 -0.245689 -0.018044 0.084030 -0.159686 -0.069036 0.001103 0.200073
polarizability: 5.70210754e+02 -4.08794104e+00 2.33663013e+02 -8.60678003e+00 -1.49811610e-01 1.93153422e+02
1716.lowfreq: -2.1863 -1.0778 -0.0013 -0.0010 0.0021 6.1938 9.9551 15.9733 21.0129
frequency: 8.6401 15.0051 20.8803 26.4522 35.0422 39.0954 49.6927 70.8609 77.7820 89.7985 94.9029 103.7161 114.2857 139.5055 158.4016 171.8196 207.6186 216.9336 231.7797 261.2821 271.1838 290.3183 302.2481 314.5255 342.9681 364.5695 381.0203 388.8294 404.6215 409.7746 424.7483 433.4957 461.9978 468.9509 475.1251 517.2432 521.0507 536.3384 543.4099 573.6078 590.6201 598.5830 616.7330 630.7489 635.9395 651.2178 675.7921 706.5572 709.7166 722.3102 736.9988 756.4541 768.0715 769.1167 780.2707 796.2221 803.7923 808.4246 839.5871 841.0551 851.8340 860.2576 884.9753 908.2302 933.4639 938.8958 944.5820 972.7918 973.2456 979.9716 982.1388 988.6560 991.5992 992.1704 993.2132 1004.9467 1021.0032 1026.6715 1032.6391 1038.0847 1042.2604 1066.0221 1071.4472 1103.9703 1107.6347 1107.8333 1130.9925 1134.7082 1136.6877 1157.6826 1161.6547 1171.1247 1180.0817 1188.2632 1192.9042 1197.4850 1201.0185 1208.7810 1238.4694 1254.3011 1263.1668 1272.9432 1286.3786 1287.1160 1298.0088 1300.3248 1304.6908 1309.0367 1316.3775 1321.5323 1330.4436 1336.7576 1340.5975 1360.2909 1363.8915 1367.9112 1372.3148 1385.2967 1394.1285 1408.2475 1422.9334 1441.9222 1445.7278 1448.2002 1448.7383 1453.6593 1458.5797 1463.5534 1468.9810 1482.2955 1483.4200 1483.7110 1516.6163 1549.2374 1585.6246 1591.5361 1613.2048 1620.3885 1627.2331 1632.6220 2814.2748 2827.0300 2857.0178 2957.2390 2971.9946 2979.3038 2990.0863 2992.5709 2995.7788 3026.9219 3030.5632 3035.1456 3052.3601 3056.0432 3057.8382 3070.9908 3092.7665 3111.3699 3112.3580 3116.3317 3131.1038 3141.5898 3149.0685 3160.8338 3170.2658 3196.2297 3523.3719 3547.9291
redmass: 5.9921 5.0184 4.1095 5.5066 3.9605 5.2632 4.9525 4.8972 4.5361 4.1671 3.2745 4.0113 6.0503 4.3684 2.5071 4.4010 3.4338 3.5145 2.4269 3.8946 3.6574 3.0234 4.2535 4.7854 5.9187 2.0872 5.8378 4.0889 2.8073 2.9840 3.2865 3.5288 3.0824 2.5741 3.9768 3.5616 3.0208 3.0308 3.6471 3.0116 3.4437 4.4579 6.3969 6.2526 4.4089 1.1890 4.7912 1.6602 1.3904 3.7151 3.4899 3.6820 2.4164 2.0032 2.5679 1.7981 2.4010 1.7169 3.4583 1.4014 1.2474 1.5848 3.0884 1.5721 2.8843 2.4143 2.8607 1.5297 2.3525 1.6800 1.5550 3.2698 1.3393 2.8556 1.3689 2.7814 2.5007 2.3159 2.4686 2.4101 1.7983 2.7929 1.8405 2.1503 2.6398 2.4806 2.1317 1.6376 2.3770 1.3791 1.2200 1.0563 2.2670 1.1110 1.2372 1.4145 1.4190 1.8961 1.3013 1.6594 1.9283 1.3636 1.7760 1.3830 1.9576 1.3419 1.3595 1.3775 1.5493 2.1857 1.2938 1.3433 1.3597 2.7254 1.7877 2.1051 1.6153 4.1713 1.4637 1.5042 4.2307 2.1147 1.0985 1.0861 1.0903 1.1020 1.0972 1.0832 1.0933 1.4888 1.9858 1.5961 2.9558 5.1829 5.9360 5.9343 6.1582 4.8303 5.9545 6.2270 1.0717 1.0705 1.0705 1.0827 1.0686 1.0589 1.0595 1.0609 1.0657 1.0865 1.0898 1.0929 1.1031 1.0931 1.1027 1.0928 1.0956 1.0901 1.0868 1.0862 1.0908 1.0958 1.0893 1.1014 1.0940 1.0948 1.0763 1.0783
irintensity: 0.1460 0.1398 0.0096 0.3634 0.2738 5.0354 0.1233 1.4538 0.6333 6.1623 0.8809 1.3897 2.0152 3.2657 1.6055 0.2318 6.4060 0.7288 0.2124 1.7071 0.2942 7.9666 0.5804 2.0184 28.6820 4.9021 1.3981 8.8513 0.0175 0.0976 2.6592 3.2149 1.9104 0.6140 15.9144 4.4471 9.8467 11.5141 1.8577 19.3028 6.3668 23.6786 0.0536 2.0293 6.5135 52.8150 10.5321 53.0926 85.7095 23.6918 4.6598 15.0984 5.9661 44.0761 20.1119 6.6918 0.8870 1.6266 2.5083 20.6896 0.0031 64.3857 3.1396 2.9664 0.5362 58.7061 32.6155 0.7394 4.3497 22.7667 1.8545 16.5411 4.3280 28.2173 2.3109 1.4177 6.4512 3.0945 8.3647 9.4225 20.1547 1.7344 15.6419 30.6415 28.2639 12.3098 38.5774 29.4563 46.3992 25.4907 20.9827 0.0205 127.7437 0.3400 87.9366 14.6189 19.7369 2.0711 42.4329 5.1093 43.8685 4.9188 49.0577 75.8573 212.5337 19.2565 8.3601 3.5055 54.7293 97.1533 3.9396 0.1569 17.7793 151.7701 46.5408 5.5841 92.9414 1.1920 2.3847 27.3568 18.9731 6.6727 11.2095 12.2858 6.5248 14.1352 13.8079 1.0025 4.2684 118.8047 288.9107 2.0427 327.9383 66.5664 45.4999 1.7869 14.7514 215.8785 83.9165 397.5849 51.8791 92.3778 143.5535 21.8547 10.9307 14.4904 23.7846 35.8671 17.5036 62.2489 31.7358 8.8612 16.3291 23.9323 56.2064 14.1551 9.9087 24.4495 10.1617 8.1875 12.5194 47.8350 13.7208 28.7814 2.6401 4.7517 11.5956 42.4051
temp: 298.150 k
press: 1.00000 atm
elementType: 8 8 7 7 7 7 6 6 6 6 6 6 6 6 6 6 6 6 6 6 6 6 6 6 6 6 6 6 6 6 1 1 1 1 1 1 1 1 1 1 1 1 1 1 1 1 1 1 1 1 1 1 1 1 1 1 1 1
symmnumber: 1
zpe: 1258450.2 jmol-1
zpe.correction: 0.479318 hartree
zpe.thermalcorrener: 0.506501 hartree
zpe.thermalcorrenthalpy: 0.507446 hartree
zpe.thermalcorrgfe: 0.416734 hartree
zpe.sumelectzpe: -1298.624132 hartree
zpe.sumelectthermal: -1298.596949 hartree
zpe.sumelectthermalent: -1298.596005 hartree
zpe.sumelectthermalfe: -1298.686716 hartree
dipole: -4.3679 -1.4166 -1.2909
dipole: 4.7699
quadrupole: -236.2256 -171.9405 -175.0412
quadrupole: 9.6463 4.1915 -1.8909
quadrupole: -41.8231 22.4619 19.3612 9.6463 4.1915 -1.8909
hfenergy: -1299.1034501 hartree
pointgroup: C01 [X(C24H28N4O2)]
dipole: -1.7229429 0.6087919 0.4272215 debye
polarizability: 570.0655887|6.1458325|233.082579|10.3396879|-4.8924864|193.8790203 unknown
InChI: InChI=1S/C24H28N4O2/c29-23(14-17-28-15-12-19(13-16-28)18-4-2-1-3-5-18)25-21-8-6-20(7-9-21)22-10-11-24(30)27-26-22/h1-9,19,25,27H,10-17H2
charge 0 multiplicity 1
58 atoms
O  0.551794 -1.770906 -0.29841
O  11.163197 0.359729 0.194424
N  -3.544121 -0.631972 0.133658
N  1.271606 0.453626 -0.089201
N  7.661318 1.31855 -0.140811
N  9.064975 1.283896 -0.164618
C  -6.443083 -0.178352 0.600569
C  -5.88691 -1.479892 -0.040811
C  -5.444703 0.979086 0.321436
C  -4.452149 -1.767799 0.442065
C  -4.021575 0.613063 0.786888
C  -7.860557 0.146695 0.135903
C  -2.133823 -0.952895 0.45504
C  -1.144796 0.008848 -0.23776
C  -8.930587 0.210383 1.06465
C  -8.146218 0.39387 -1.233834
C  0.288979 -0.535657 -0.203901
C  -10.246628 0.512025 0.644428
C  -9.458272 0.695396 -1.659253
C  -10.51583 0.756306 -0.72122
C  2.685944 0.314229 -0.090381
C  5.545933 0.197451 -0.067785
C  3.348323 -0.936308 -0.198339
C  3.463163 1.503014 0.026018
C  7.790556 -1.166413 -0.067629
C  7.025403 0.152846 -0.073034
C  4.756619 -0.979365 -0.184354
C  4.861964 1.445269 0.035923
C  9.154927 -1.021748 0.645887
C  9.906461 0.226274 0.198617
H  -6.470864 -0.335294 1.700337
H  -6.542444 -2.33579 0.209015
H  -5.878453 -1.376392 -1.142505
H  -5.779571 1.900138 0.835766
H  -5.421157 1.192815 -0.764091
H  -4.472643 -1.981133 1.544561
H  -4.060037 -2.671717 -0.059766
H  -3.332103 1.439654 0.535683
H  -4.014586 0.503978 1.905601
H  -1.912297 -1.97001 0.086085
H  -1.942583 -0.958023 1.559073
H  -1.459382 0.096758 -1.296953
H  -1.188388 1.023849 0.201689
H  -8.729173 0.021449 2.126878
H  -7.338769 0.349733 -1.974937
H  -11.058309 0.555846 1.379784
H  -9.658055 0.882347 -2.720762
H  -11.53433 0.990115 -1.051102
H  0.928035 1.413787 -0.007892
H  7.205384 -1.965799 0.414946
H  7.950229 -1.479291 -1.120891
H  2.756493 -1.848169 -0.290993
H  2.961072 2.475949 0.110724
H  9.801062 -1.896465 0.469231
H  9.007767 -0.94093 1.741491
H  5.236001 -1.959088 -0.279947
H  5.456308 2.358973 0.123025
H  9.496387 2.188462 -0.366214
