program: Gaussian 09
title: 000178192
version: EM64L-G09RevD.01
frameworkgroup: C1[X(C14H5ClF9IN2OS)]
method: RPBEPBE
basis: SDD
operation: Freq
keyword: #p
keyword: freq=noraman
keyword: PBEPBE/SDD
title: #p freq=noraman PBEPBE/SDD
converged: YES YES NO NO
title: Mulliken charges:
elementType: I Cl S F F F F F F F F F O N N C C C C C C C C C C C C C C H H H H H
charge: 0.109511 0.083891 0.496492 -0.153415 -0.153119 -0.152116 -0.152843 -0.155173 -0.154043 -0.149451 -0.143569 -0.145115 -0.221998 -0.083002 -0.032073 0.281604 0.302788 0.323665 -0.480947 -0.381694 0.190138 -0.451280 -0.118641 0.248265 0.259036 -0.793487 0.451169 -0.674077 0.281313 0.303325 0.284072 0.302099 0.361130 0.317545
chargesum: 0.00000
title: Mulliken charges with hydrogens summed into heavy atoms:
elementType: I Cl S F F F F F F F F F O N N C C C C C C C C C C C C C C
charge: 0.109511 0.083891 0.496492 -0.153415 -0.153119 -0.152116 -0.152843 -0.155173 -0.154043 -0.149451 -0.143569 -0.145115 -0.221998 -0.083002 -0.032073 0.281604 0.302788 0.323665 -0.177622 -0.097622 0.190138 -0.149182 -0.118641 0.248265 0.259036 -0.114811 0.451169 -0.674077 0.281313
polarizability: 3.36271270e+02 -1.26581783e+01 2.46391542e+02 1.16723233e+01 -9.22743515e+00 1.32829455e+02
1716.lowfreq: -8.4771 -3.9165 -0.0011 -0.0004 0.0012 2.6671 9.2476 10.5673 13.1018
frequency: 8.8867 10.2580 13.0237 17.1082 18.9226 30.1034 36.1601 42.9140 72.9285 86.3605 91.3493 106.8291 115.1319 126.7683 138.3127 140.4815 148.4299 185.3735 225.0122 228.8891 250.8574 262.8301 276.8972 292.2547 308.9364 321.4305 327.1843 332.4937 345.7758 368.4516 382.9045 394.0970 399.0937 423.7081 440.3227 441.4435 473.2631 476.2469 505.7554 512.6815 530.9913 541.6690 577.5238 596.2522 607.7023 614.5806 620.8399 635.4004 636.6334 657.8856 693.9708 699.7405 714.8691 730.2644 786.3734 794.4037 805.5031 897.8116 930.0905 950.5360 958.6934 961.5772 986.5778 995.3867 996.7757 998.6751 1009.4877 1023.3831 1037.3580 1043.0573 1074.7087 1097.4851 1120.7231 1149.1371 1193.4674 1212.5923 1229.7355 1267.1264 1300.3800 1305.0019 1332.3447 1367.3533 1391.4946 1427.2787 1440.8711 1453.1706 1495.7207 1527.4925 1554.6185 1615.0409 1617.7982 3097.2922 3125.5899 3174.1555 3175.8379 3193.1832
redmass: 19.4795 19.9801 19.1453 19.0199 17.7373 24.3757 15.0294 27.7952 18.3656 14.4007 17.4649 17.5663 16.5755 14.7656 11.3244 9.7717 8.7471 15.7911 8.6687 12.5881 15.0790 14.8698 7.6494 6.3884 7.9837 9.0724 7.1400 10.8467 12.4483 8.4763 12.3516 8.9148 9.3025 9.8695 11.4600 9.5119 12.9026 15.6546 13.2495 8.3023 7.5664 9.7613 9.4153 8.8264 13.4384 12.0176 14.7907 10.2170 9.9297 7.8531 11.4307 2.7923 6.6416 4.9619 11.2492 11.7118 2.4954 2.7942 1.7533 1.4848 1.4301 12.7666 6.3630 8.6082 12.7417 8.6918 9.5352 7.7750 8.7084 11.1484 7.0084 2.7851 3.9098 2.3812 1.9742 1.8548 2.4226 2.2952 1.2566 3.5011 5.2105 5.1213 8.4382 1.1888 3.5920 3.4684 8.7760 11.0892 11.8052 6.1483 6.1813 1.0555 1.0948 1.0928 1.0941 1.1130
irintensity: 0.0332 0.0120 0.4619 0.0462 0.0434 0.2220 0.6164 0.0525 0.4400 4.3464 1.3899 1.7064 0.5687 2.7117 0.6337 0.2049 1.5207 0.4724 1.1022 0.1950 2.0311 2.3988 0.7281 0.4661 0.3721 4.8345 6.5668 6.2724 22.7646 3.5788 8.1256 3.1203 8.6388 5.1589 0.9024 6.2722 4.4792 8.7929 4.4258 10.1409 28.0446 2.5103 16.9328 9.7928 36.3667 7.4887 8.7523 12.1661 11.5532 21.4090 4.3438 5.2661 38.8232 29.9875 12.7307 62.0708 129.7694 3.6389 127.8942 6.8898 18.8885 66.5520 1.3896 31.6464 180.9182 344.6555 64.5238 103.9372 13.1815 112.2445 89.1715 134.1516 504.2331 11.9788 226.4974 440.1389 400.3681 31.6423 0.8231 0.9370 344.9078 97.9183 2.9998 56.8197 5.9334 5.0429 113.0544 63.9629 156.4175 11.4410 19.6804 4.4249 26.3268 5.1792 2.6917 3.2606
temp: 298.150 k
press: 1.00000 atm
elementType: 53 17 16 9 9 9 9 9 9 9 9 9 8 7 7 6 6 6 6 6 6 6 6 6 6 6 6 6 6 1 1 1 1 1
symmnumber: 1
zpe: 462676.6 jmol-1
zpe.correction: 0.176224 hartree
zpe.thermalcorrener: 0.204074 hartree
zpe.thermalcorrenthalpy: 0.205018 hartree
zpe.thermalcorrgfe: 0.108888 hartree
zpe.sumelectzpe: -2487.318925 hartree
zpe.sumelectthermal: -2487.291075 hartree
zpe.sumelectthermalent: -2487.290131 hartree
zpe.sumelectthermalfe: -2487.386261 hartree
dipole: 1.4031 1.3574 -0.0804
dipole: 1.9539
quadrupole: -222.0939 -205.2362 -193.8984
quadrupole: -9.1331 6.9623 0.6903
quadrupole: -15.0177 1.8400 13.1778 -9.1331 6.9623 0.6903
hfenergy: -2487.4951492 hartree
pointgroup: C01 [X(C14H5Cl1F9I1N2O1S1)]
dipole: 0.5066817 0.2791447 -0.5062487 debye
polarizability: 338.1774892|3.3495631|158.6211873|8.7895633|-48.298684|218.6935907 unknown
InChI: InChI=1S/C14H5ClF9IN2OS/c15-9-8(14(22,23)24)26-11(29-9)27(4-25)10(28)5-1-6(12(16,17)18)3-7(2-5)13(19,20)21/h1-3H,4H2
charge 0 multiplicity 1
34 atoms
I  -0.870207 -1.850128 2.723516
Cl -6.171325 -0.114614 -2.037194
S  -3.099059 -0.090619 -1.765274
F  4.013823 -1.309068 2.824745
F  5.41663 -2.050279 1.205014
F  3.412377 -3.07068 1.533596
F  3.772625 2.300834 -3.115259
F  4.728696 3.0291 -1.193654
F  5.653689 1.298667 -2.325229
F  -5.651413 1.430658 2.144345
F  -5.700162 -0.823909 2.355184
F  -7.033793 0.199237 0.83257
O  -0.487379 0.071924 -2.007866
N  -1.053433 0.049955 0.244547
N  -3.346276 0.148744 0.888476
C  1.377596 0.030983 -0.49936
C  3.410321 -0.869253 0.515045
C  3.573544 0.894229 -1.146631
C  2.173408 0.899776 -1.289305
C  2.00151 -0.865786 0.397746
C  -0.095788 0.032812 -0.802977
C  4.205722 0.012172 -0.242204
C  -2.437797 0.050083 -0.065679
C  4.057367 -1.81399 1.496083
C  4.415498 1.860118 -1.940704
C  -0.728125 0.120954 1.660577
C  -4.651489 0.111154 0.388657
C  -4.745192 -0.024452 -0.987261
C  -5.749144 0.224642 1.406304
H  1.692272 1.553285 -2.022877
H  1.411925 -1.584877 0.977958
H  5.295605 -0.005743 -0.150835
H  -1.475943 0.726916 2.1860
H  0.297117 0.472857 1.815945
