program: Gaussian 09
title: 000178108
version: EM64L-G09RevD.01
frameworkgroup: C1[X(C14H17ClN2O2)]
method: RPBEPBE
basis: SDD
operation: Freq
keyword: #p
keyword: freq=noraman
keyword: PBEPBE/SDD
title: #p freq=noraman PBEPBE/SDD
converged: YES YES NO NO
title: Mulliken charges:
elementType: Cl O O N N C C C C C C C C C C C C C C H H H H H H H H H H H H H H H H H
charge: -0.042280 -0.268163 -0.224224 -0.122055 -0.418764 0.321825 -0.423735 -0.709454 -0.735023 -0.695744 -0.543876 0.155326 0.157270 0.123917 0.354051 -0.313571 -0.390400 -0.136791 -0.201427 0.252787 0.227364 0.220328 0.209339 0.216285 0.220066 0.207404 0.222108 0.204021 0.236888 0.211343 0.279378 0.272275 0.331313 0.296017 0.243666 0.262538
chargesum: 0.00000
title: Mulliken charges with hydrogens summed into heavy atoms:
elementType: Cl O O N N C C C C C C C C C C C C C C
charge: -0.042280 -0.268163 -0.224224 -0.122055 -0.087451 0.321825 0.056416 -0.063502 -0.085446 -0.043493 0.007776 0.155326 0.157270 0.123917 0.354051 -0.017554 -0.146734 -0.136791 0.061112
polarizability: 2.50314457e+02 2.21836069e+01 1.95544070e+02 -5.80104970e+00 3.73748765e+00 1.09799215e+02
1716.lowfreq: -15.7283 -6.7397 -0.0022 -0.0021 -0.0015 6.6746 14.6630 32.3227 60.0253
frequency: 6.0755 32.3154 60.0165 79.5737 94.3983 134.6023 153.2023 159.8399 173.8280 197.6825 230.2853 242.1732 267.0202 276.2424 298.5542 299.4129 334.1767 340.7432 355.3595 365.6042 374.2330 396.8442 421.4034 444.5736 456.0312 493.0011 514.4955 534.2069 568.9454 594.6188 658.7601 665.3463 688.2493 716.9228 731.7184 754.9773 773.6679 817.3759 847.7030 872.1618 893.7072 906.8586 910.1230 926.6371 930.6093 939.3017 949.9892 950.4467 983.6061 1022.8163 1039.0559 1083.5649 1110.8745 1136.9692 1147.3168 1213.7314 1215.5935 1237.7110 1246.5818 1253.5922 1259.1728 1293.1405 1329.6416 1337.4227 1355.0334 1361.6547 1373.7846 1377.9204 1386.6678 1404.0248 1407.7139 1440.2078 1441.9033 1454.2875 1462.2845 1466.4086 1468.8165 1470.0702 1480.7532 1487.3150 1499.4511 1560.6783 1578.4988 1605.1015 1640.1342 2964.4672 2969.3609 2977.9408 2988.9456 2997.5756 3058.2089 3061.7376 3065.5217 3068.3342 3069.9662 3075.8170 3090.5124 3136.4119 3137.5509 3174.1569 3175.7906 3504.8876
redmass: 2.7690 5.3620 8.3759 5.2901 5.0317 5.1883 5.7461 5.2633 7.2874 1.0646 2.4811 1.3006 2.3860 3.2980 2.3868 1.8922 4.6140 3.9061 4.7320 2.6329 2.7196 3.3146 2.1103 2.1537 5.2677 4.4778 3.9022 3.1354 3.3348 4.9490 3.2552 5.4224 2.3337 4.5835 3.7224 4.7015 5.2048 1.5584 4.5990 2.7878 2.1139 2.7098 1.7672 1.7600 1.5482 1.2192 1.5724 1.8488 2.4129 1.4279 1.5781 2.0133 3.0373 1.8873 1.5610 2.3197 2.2538 2.5828 2.3522 2.9675 1.5167 2.1327 1.3161 2.9357 2.5105 1.2896 1.2209 1.2100 5.4873 1.4119 1.6489 1.2758 1.9889 1.0558 1.0553 1.1741 1.1544 2.1918 1.0675 1.0635 1.0609 7.0133 7.9710 6.9837 5.5666 1.0356 1.0357 1.0371 1.0607 1.0689 1.0995 1.0999 1.0995 1.1001 1.0998 1.0986 1.0993 1.0900 1.0944 1.0935 1.0953 1.0758
irintensity: 0.0217 1.2417 1.4456 1.4436 3.1921 1.1464 2.4939 3.9172 0.2874 0.0074 1.6861 0.2593 0.7512 0.8630 0.9990 1.1020 0.7315 0.7117 4.8200 2.7987 4.1386 1.8964 10.2806 1.7001 15.9683 23.3676 7.7243 19.2840 7.2662 5.0181 28.1736 10.0933 62.4036 20.1915 1.9767 4.7421 7.0756 53.4820 23.6584 12.2682 4.8573 9.9299 9.4032 6.3473 0.4536 0.5763 3.7753 8.2752 16.6506 0.4264 2.4414 13.1325 22.6232 65.6270 10.7185 71.4621 29.9973 71.7758 4.3193 11.7769 16.6655 10.8049 1.7105 116.6573 4.6338 4.7728 25.4229 15.7214 1.7307 70.2807 53.2529 33.2797 39.6951 6.8020 7.2055 27.3937 36.5542 106.0461 22.1813 9.7091 26.7194 120.2330 90.4053 10.0923 479.9791 32.6205 30.8292 24.8643 24.1635 14.0346 10.3758 16.8287 10.5926 32.6028 62.4210 73.5137 30.5982 7.3723 1.8738 0.1784 5.2945 30.0424
temp: 298.150 k
press: 1.00000 atm
elementType: 17 8 8 7 7 6 6 6 6 6 6 6 6 6 6 6 6 6 6 1 1 1 1 1 1 1 1 1 1 1 1 1 1 1 1 1
symmnumber: 1
zpe: 753555.9 jmol-1
zpe.correction: 0.287014 hartree
zpe.thermalcorrener: 0.305546 hartree
zpe.thermalcorrenthalpy: 0.306491 hartree
zpe.thermalcorrgfe: 0.238722 hartree
zpe.sumelectzpe: -1262.321397 hartree
zpe.sumelectthermal: -1262.302865 hartree
zpe.sumelectthermalent: -1262.301921 hartree
zpe.sumelectthermalfe: -1262.369689 hartree
dipole: -0.2055 1.6136 2.1201
dipole: 2.6722
quadrupole: -111.9234 -130.0567 -123.2875
quadrupole: -17.7592 1.4618 -3.2256
quadrupole: 9.8325 -8.3009 -1.5316 -17.7592 1.4618 -3.2256
hfenergy: -1262.6084116 hartree
pointgroup: C01 [X(C14H17Cl1N2O2)]
dipole: -0.1417907 0.6272742 0.8316824 debye
polarizability: 245.9509195|26.7025114|199.9826315|-5.5126929|3.0831443|109.7241914 unknown
InChI: InChI=1S/C14H17ClN2O2/c1-14(2,3)8-17-7-12(18)16-11-5-4-9(15)6-10(11)13(17)19/h4-6,16H,7-8H2,1-3H3
charge 0 multiplicity 1
36 atoms
Cl -4.612895 -2.585134 0.344395
O  0.345286 -1.575588 -1.406989
O  0.84179 3.602845 -0.055837
N  1.181765 0.185524 -0.127292
N  -1.034279 2.259717 -0.3183
C  3.491938 -0.927066 0.246244
C  2.560098 -0.033077 -0.636293
C  4.830902 -1.055022 -0.530172
C  3.767955 -0.281511 1.630022
C  2.869688 -2.331688 0.448112
C  0.930604 1.293229 0.816544
C  0.140971 -0.586407 -0.631618
C  -1.274271 -0.236562 -0.222964
C  0.271602 2.49009 0.119446
C  -1.815833 1.082863 -0.139489
C  -2.149944 -1.345573 -0.08087
C  -3.21214 1.255041 0.068597
C  -3.516775 -1.145497 0.148795
C  -4.069478 0.151014 0.215091
H  2.455782 -0.511093 -1.626486
H  3.02914 0.961217 -0.773603
H  4.67601 -1.52528 -1.519119
H  5.303717 -0.066754 -0.689338
H  5.543672 -1.683384 0.034738
H  4.502538 -0.889236 2.190509
H  4.185567 0.73942 1.530086
H  2.850831 -0.229051 2.245391
H  3.563994 -2.978287 1.017431
H  2.647001 -2.813526 -0.519501
H  1.920709 -2.270374 1.011489
H  1.886906 1.644516 1.224025
H  0.296734 0.948127 1.655906
H  -1.502182 3.082453 -0.712594
H  -1.733304 -2.349526 -0.198728
H  -3.62485 2.268672 0.127738
H  -5.140851 0.294007 0.381034
