program: Gaussian 09
title: 000178122
version: EM64L-G09RevD.01
frameworkgroup: C1[X(C11H21N5OS)]
method: RPBEPBE
basis: SDD
operation: Freq
keyword: #p
keyword: freq=noraman
keyword: PBEPBE/SDD
title: #p freq=noraman PBEPBE/SDD
converged: YES YES NO NO
title: Mulliken charges:
elementType: S O N N N N N C C C C C C C C C C C H H H H H H H H H H H H H H H H H H H H H
charge: -0.015058 -0.274137 -0.039678 -0.009896 -0.316420 -0.021432 -0.064715 -0.377122 -0.356910 -0.591872 -0.353007 -0.330850 -0.391342 -0.351479 0.256896 -0.240419 -0.682648 -0.685173 0.253866 0.274654 0.236968 0.207562 0.290699 0.265715 0.224445 0.206164 0.209318 0.197707 0.218647 0.252128 0.203149 0.197983 0.317804 0.206607 0.224182 0.216876 0.211205 0.221029 0.208553
chargesum: 0.00000
title: Mulliken charges with hydrogens summed into heavy atoms:
elementType: S O N N N N N C C C C C C C C C C C
charge: -0.015058 -0.274137 -0.039678 -0.009896 0.001384 -0.021432 -0.064715 0.151398 0.087620 -0.035458 0.077601 0.076175 0.079434 0.049652 0.256896 -0.240419 -0.034982 -0.044385
polarizability: 2.24093679e+02 -2.10853502e+01 1.72419520e+02 1.05458015e+01 -1.71395695e+01 1.38919919e+02
1716.lowfreq: -14.4683 -6.6562 -0.0023 0.0002 0.0004 4.1277 6.8627 13.2241 35.6879
frequency: -10.9528 12.4572 35.6697 41.3912 46.4482 61.3093 75.5183 79.5307 89.4281 119.4748 135.0144 181.0292 196.2325 218.8562 231.3900 233.5796 239.5343 253.7065 273.0984 274.6639 279.5710 354.8003 412.1824 436.1619 461.0059 505.7343 543.6453 556.7630 577.2134 644.3750 664.9595 673.6718 723.6686 750.3605 751.9217 784.2576 799.4457 824.5459 842.1189 874.1967 886.5387 896.7528 951.4736 955.8677 974.1112 992.9659 1014.5798 1019.6663 1029.6450 1049.5531 1065.8957 1102.1018 1121.0744 1121.3769 1135.5413 1137.7130 1172.1237 1202.6887 1223.7553 1227.6983 1244.1128 1251.9260 1261.8535 1276.5962 1290.9838 1295.4935 1299.5531 1311.9422 1316.4344 1339.9975 1343.9805 1351.3705 1362.2187 1364.0092 1386.7319 1392.0981 1392.7673 1441.8142 1456.4925 1459.1930 1463.0712 1472.6558 1475.1142 1478.6255 1480.2783 1483.7836 1484.9715 1486.6525 1533.2065 1633.1384 2966.7821 2975.1398 2976.7282 2978.6196 2980.2230 2983.3344 2991.2600 2997.7122 3008.1763 3010.8208 3031.6713 3044.1301 3048.5244 3063.9042 3071.3838 3075.8038 3077.3360 3077.9273 3080.8810 3110.3139 3300.6166
redmass: 3.7315 3.8400 5.7036 4.8445 5.1337 1.8968 2.6181 2.6268 3.5069 4.1029 3.4083 3.3965 6.1644 3.0449 1.3605 1.3050 4.2472 2.8640 3.2158 2.4318 2.4591 3.0312 3.8991 2.9730 4.5419 2.7871 5.2034 7.0304 4.0473 5.0281 8.0233 4.4426 1.1889 1.2108 1.1249 5.5670 1.7422 1.8442 2.1458 1.4044 1.7682 3.6019 1.3415 2.6812 1.4948 2.4534 2.1596 5.4958 6.3903 2.9081 2.5067 3.3046 2.0555 2.1666 3.6466 2.0204 3.3815 2.0226 2.9744 1.3631 1.3981 1.9371 1.2779 1.8940 1.1317 1.7479 1.6903 1.2265 1.2973 1.3988 1.8942 1.4490 1.3948 1.5324 1.5197 1.2109 1.2158 1.1019 1.0795 1.0777 1.0906 1.0627 1.0529 1.0426 1.0415 1.0878 1.0746 1.0840 1.6329 6.5419 1.0591 1.0374 1.0360 1.0591 1.0610 1.0595 1.0657 1.0627 1.0647 1.0982 1.0974 1.1013 1.1055 1.1014 1.1006 1.1000 1.0994 1.1019 1.0992 1.0989 1.0827
irintensity: 0.2151 0.1841 0.4590 1.0818 5.5178 1.8647 4.1129 8.5049 9.8313 0.7414 0.6694 0.8168 2.1190 4.8664 0.9792 0.4579 1.9700 1.4602 0.9848 1.0595 3.3463 4.1680 9.0354 2.5960 8.8336 1.6261 4.6607 2.7016 5.5711 3.3138 0.0384 4.8781 47.1777 13.0113 113.5784 3.5310 3.2313 0.3671 0.8284 0.9826 2.3313 2.5429 8.1459 7.6964 15.5065 5.2714 7.4604 1.2339 20.7745 0.2587 1.3508 1.4175 3.5042 10.5140 47.9276 4.6724 4.7896 50.6730 135.9168 21.8948 35.7052 16.1777 11.4271 66.4110 0.9199 34.1662 12.1985 9.8877 10.0910 17.1836 25.3451 1.1496 3.5534 0.4261 0.5519 10.8156 11.3621 47.3240 3.1513 6.8143 27.7196 7.8383 3.3333 12.9288 14.4526 9.5516 13.8515 17.6445 180.5069 257.2422 15.6709 27.9508 40.2934 68.2469 12.2724 10.2204 21.7845 51.8565 13.9439 1.2741 3.0642 39.5421 7.9515 1.9917 79.0191 5.4075 41.9919 75.8332 38.5015 2.9070 217.6789
temp: 298.150 k
press: 1.00000 atm
elementType: 16 8 7 7 7 7 7 6 6 6 6 6 6 6 6 6 6 6 1 1 1 1 1 1 1 1 1 1 1 1 1 1 1 1 1 1 1 1 1
symmnumber: 1
zpe: 850678.9 jmol-1
zpe.correction: 0.324006 hartree
zpe.thermalcorrener: 0.343715 hartree
zpe.thermalcorrenthalpy: 0.344659 hartree
zpe.thermalcorrgfe: 0.272750 hartree
zpe.sumelectzpe: -1177.342793 hartree
zpe.sumelectthermal: -1177.323084 hartree
zpe.sumelectthermalent: -1177.322140 hartree
zpe.sumelectthermalfe: -1177.394049 hartree
dipole: 0.7424 -4.0234 2.9363
dipole: 5.0359
quadrupole: -103.2434 -140.2772 -115.0684
quadrupole: -3.3406 9.1583 13.3415
quadrupole: 16.2863 -20.7476 4.4613 -3.3406 9.1583 13.3415
hfenergy: -1177.6667992 hartree
pointgroup: C01 [X(C11H21N5O1S1)]
dipole: -0.7840085 1.7543494 -0.4827772 debye
polarizability: 185.9301713|28.0143138|216.0768098|9.1522968|8.5284894|133.4261361 unknown
InChI: InChI=1S/C11H21N5OS/c1-3-5-7-12-10(17)9-15-11(18)13-14-16(15)8-6-4-2/h12H,3-9H2,1-2H3
charge 0 multiplicity 1
39 atoms
S  0.383717 -2.663872 -1.050995
O  -1.972805 1.909936 -0.945152
N  1.693084 1.016241 -0.721905
N  0.808541 0.067152 -1.239896
N  -2.150159 -0.3959 -0.508177
N  2.674248 0.36333 -0.019585
N  2.417318 -0.963238 -0.045686
C  1.59837 2.481833 -0.930733
C  2.258261 3.263884 0.223741
C  -0.388737 0.369819 -2.021801
C  1.532148 3.116775 1.579948
C  -4.581251 -0.939012 -0.150097
C  -3.289043 -0.314796 0.426203
C  -4.483871 -2.460544 -0.408628
C  -1.597863 0.70536 -1.107967
C  1.224393 -1.194092 -0.780502
C  2.169642 4.00283 2.671261
C  -5.802212 -3.050906 -0.953862
H  2.082853 2.726611 -1.895881
H  0.52272 2.730859 -0.99466
H  3.315361 2.957402 0.325457
H  2.256056 4.328448 -0.083535
H  -0.582299 -0.54049 -2.619717
H  -0.206494 1.226198 -2.687931
H  1.563791 2.059189 1.903982
H  0.463342 3.38388 1.456479
H  -4.84791 -0.413542 -1.088115
H  -5.402632 -0.744426 0.569398
H  -3.011722 -0.830216 1.366654
H  -3.444619 0.754844 0.64971
H  -3.667155 -2.668263 -1.12908
H  -4.207723 -2.97449 0.534789
H  -1.690886 -1.309416 -0.673995
H  2.125254 5.073371 2.395495
H  1.646971 3.88153 3.636837
H  3.231624 3.736839 2.828107
H  -6.083012 -2.57354 -1.91143
H  -5.713708 -4.138094 -1.130895
H  -6.633993 -2.890196 -0.242235
