program: Gaussian 09
title: 000178100
version: EM64L-G09RevD.01
frameworkgroup: C1[X(C18H30O2)]
method: RPBEPBE
basis: SDD
operation: Freq
keyword: #pfreq=noraman
keyword: PBEPBE/SDD
title: #p freq=noraman PBEPBE/SDD
converged: YES YES NO NO
title: Mulliken charges:
elementType: O O C C C C C C C C C C C C C C C C C C H H H H H H H H H H H H H H H H H H H H H H H H H H H H H H
charge: -0.438216 -0.229747 -0.357266 -0.381130 -0.396213 -0.355097 -0.353807 -0.475669 -0.393844 -0.385432 -0.365014 -0.477261 -0.369304 -0.181246 -0.189664 -0.479852 -0.494970 0.179005 0.182333 -0.539578 0.190423 0.203838 0.194393 0.189149 0.192995 0.203398 0.193416 0.185049 0.191299 0.206671 0.201151 0.205841 0.201870 0.193305 0.220318 0.210508 0.187555 0.193090 0.201874 0.206562 0.204440 0.212415 0.222212 0.223490 0.275509 0.248783 0.231234 0.226677 0.375707 0.308797
chargesum: 0.00000
title: Mulliken charges with hydrogens summed into heavy atoms:
elementType: O O C C C C C C C C C C C C C C C C C C
charge: -0.062510 -0.229747 0.036995 0.002412 0.000180 0.023367 0.044164 -0.068676 0.001331 0.045395 0.015631 -0.068826 0.047551 0.040966 0.033826 0.044441 -0.037059 0.179005 0.182333 -0.230782
polarizability: 2.41608071e+02 7.16231882e+00 2.14224717e+02 4.14212616e+00 7.74025762e+00 1.45387818e+02
1716.lowfreq: -6.2456 -4.1845 -0.0003 0.0000 0.0002 4.2142 17.3244 28.6973 36.3100
frequency: 17.1902 28.6964 36.3001 41.7942 49.2660 54.8375 59.6320 61.9911 69.5019 85.2512 100.3928 106.9351 115.6395 124.7780 130.1128 144.4790 148.5119 173.4531 197.8013 204.9506 220.8476 249.4299 279.8516 327.5420 332.0715 357.2988 380.7609 411.6672 451.3097 463.1390 488.6715 499.3634 515.4115 524.7404 589.7261 640.7196 679.1395 689.5719 718.8420 722.2178 729.3059 738.9757 769.1021 790.6217 820.5253 833.0288 853.5504 856.7721 881.2254 905.0252 931.5759 935.9060 968.9949 972.6220 986.0941 994.1597 1005.4507 1012.4765 1030.1599 1044.6313 1047.3754 1057.0805 1068.1888 1079.0607 1087.2512 1087.5499 1096.8262 1106.9369 1114.7458 1120.5788 1164.2926 1175.4475 1192.4492 1211.0868 1221.1557 1228.5272 1240.3144 1246.9091 1255.3061 1264.8892 1277.9427 1279.6191 1281.0771 1284.1120 1286.3541 1289.1616 1290.6108 1297.2289 1299.3495 1313.3289 1321.8492 1324.4117 1338.9149 1349.1950 1354.6188 1356.0602 1358.0590 1375.6974 1439.2216 1456.5930 1458.6208 1458.8792 1460.0919 1460.8628 1462.5400 1465.3189 1466.6267 1472.5345 1477.7837 1484.2491 1487.7717 1673.8829 1682.1548 2130.9885 2950.3407 2952.8034 2954.2982 2954.6418 2955.9417 2961.1513 2961.2762 2966.9034 2967.8163 2969.1009 2977.7851 2982.6204 2987.6520 2993.3297 2993.6678 2999.3722 3005.6934 3013.9781 3014.4502 3020.7872 3022.1245 3028.0523 3035.3957 3039.2800 3052.8728 3056.4541 3060.4924 3066.6524 3390.2796 3507.3633
redmass: 5.8666 4.6795 3.7326 3.3065 2.3864 1.7840 4.9350 4.8506 4.1074 2.4587 3.8456 2.1010 2.1025 2.1732 2.3030 3.9640 2.0402 3.4726 2.9639 2.7421 3.6475 3.3128 2.8139 3.8659 3.1261 3.6853 2.5431 3.5179 3.4001 2.7283 2.4573 2.0453 2.6446 3.6261 4.1350 1.3488 1.1967 1.1882 1.0824 1.0748 1.1409 1.1552 1.3025 1.3824 1.4206 1.9859 2.1787 2.5173 2.1249 1.6277 1.8565 3.0315 1.6919 1.6636 1.6251 2.0336 2.4063 2.3406 2.6349 2.7701 2.2934 2.8651 2.5571 2.2140 2.3506 2.1213 2.9021 1.7253 1.5650 1.4344 1.7854 1.3461 1.2931 1.4202 1.3836 1.3208 1.2965 1.4157 1.3427 1.2583 1.2360 1.1865 1.2092 1.1566 1.0785 1.2300 1.1943 1.1176 1.1413 1.2801 1.3563 1.3844 1.4420 1.5054 1.5485 1.6202 1.5973 1.7756 1.0857 1.0764 1.0942 1.0822 1.0828 1.0712 1.0894 1.0712 1.0818 1.0950 1.0968 1.0995 1.0995 8.0603 6.5911 5.9544 1.0588 1.0595 1.0590 1.0594 1.0597 1.0610 1.0610 1.0604 1.0608 1.0586 1.0628 1.0599 1.0955 1.0923 1.0646 1.0977 1.0996 1.1005 1.1007 1.1002 1.0999 1.0983 1.1035 1.1036 1.1043 1.0943 1.1029 1.0878 1.1621 1.0638
irintensity: 0.2397 0.7049 0.1835 0.3022 0.0725 0.0795 0.0699 0.6790 0.9542 0.2238 0.2207 0.0689 0.0336 0.0713 0.1740 0.5579 0.0520 0.6032 1.4586 0.4352 1.0110 1.5112 0.9027 2.2717 5.0340 7.3669 0.3610 1.0846 6.5598 2.6045 3.0059 11.5786 30.6887 1.5248 13.1266 87.9221 122.8751 97.3600 21.8183 5.1769 2.7117 0.7487 5.6901 2.2924 2.5503 0.6491 0.7792 5.6958 1.1004 1.3261 1.2990 0.1947 40.2608 3.5690 36.8624 22.5544 58.4001 64.6581 2.6387 58.5858 37.9329 8.7594 0.9201 3.2166 4.3034 2.9984 25.2110 1.3050 0.6002 0.9357 10.8670 0.9154 12.9251 3.2186 3.0281 7.1422 2.2017 2.1536 2.6628 0.7442 1.9540 4.5212 0.2871 3.3772 1.8886 0.1544 0.3531 3.4963 0.8251 0.6197 1.8865 9.6031 0.1721 2.3032 3.4961 5.1614 1.3978 24.0223 35.9444 1.5264 13.7228 10.8792 2.4360 1.8935 3.1879 0.9866 3.6166 0.3158 1.3568 1.9834 39.1637 236.2047 0.0524 8.9069 5.6754 4.4487 9.5360 13.0691 19.7892 28.9364 28.0682 185.4789 28.2580 4.8974 7.4724 84.8662 0.1742 9.7876 26.5944 6.5069 6.6171 22.0610 8.6489 23.6793 4.9569 3.7803 45.0724 105.7380 114.4911 1.4304 63.6644 101.6378 109.5199 17.4892
temp: 298.150 k
press: 1.00000 atm
elementType: 8 8 6 6 6 6 6 6 6 6 6 6 6 6 6 6 6 6 6 6 1 1 1 1 1 1 1 1 1 1 1 1 1 1 1 1 1 1 1 1 1 1 1 1 1 1 1 1 1 1
symmnumber: 1
zpe: 1146490.8 jmol-1
zpe.correction: 0.436675 hartree
zpe.thermalcorrener: 0.461583 hartree
zpe.thermalcorrenthalpy: 0.462527 hartree
zpe.thermalcorrgfe: 0.378154 hartree
zpe.sumelectzpe: -852.696760 hartree
zpe.sumelectthermal: -852.671852 hartree
zpe.sumelectthermalent: -852.670908 hartree
zpe.sumelectthermalfe: -852.755281 hartree
dipole: 1.9080 1.0850 0.7409
dipole: 2.3166
quadrupole: -128.2685 -128.3128 -123.0844
quadrupole: -2.4500 -2.8302 -4.0201
quadrupole: -1.7133 -1.7576 3.4708 -2.4500 -2.8302 -4.0201
hfenergy: -853.1334351 hartree
pointgroup: C01 [X(C18H30O2)]
dipole: -0.7538864 -0.4140774 0.3015065 debye
polarizability: 241.7187839|6.7279881|213.8433503|-4.8975203|-8.6371223|145.6584723 unknown
InChI: InChI=1S/C18H30O2/c1-2-3-4-5-6-7-8-9-10-11-12-13-14-15-16-17-18(19)20/h1,9-10,19H,3-8,11-17H2
charge 0 multiplicity 1
50 atoms
O  5.661899 -0.220613 -0.042389
O  5.388274 1.948105 -0.820458
C  -1.360071 2.349217 0.454257
C  0.063689 2.691414 -0.039877
C  -2.458915 3.283251 -0.098514
C  1.119907 1.682519 0.465844
C  -2.538391 -1.870321 -0.357361
C  -3.899026 2.818982 0.268652
C  -4.015495 -2.115121 0.019266
C  2.531632 1.911212 -0.117889
C  -1.575589 -2.98885 0.102159
C  -4.957669 -0.956493 -0.421464
C  -0.097656 -2.602069 -0.125792
C  -4.27606 1.507532 -0.392504
C  -4.62683 0.362368 0.250379
C  3.509154 0.808426 0.335196
C  0.904984 -3.704243 0.320245
C  4.900416 0.955031 -0.240215
C  2.307351 -3.255564 0.230303
C  3.46509 -2.83144 0.159221
H  -1.384041 2.371811 1.564275
H  -1.598757 1.306698 0.161197
H  0.34089 3.71748 0.279592
H  0.069988 2.698451 -1.150049
H  -2.369938 3.339379 -1.203666
H  -2.300692 4.312982 0.28124
H  1.163785 1.71996 1.574746
H  0.783571 0.656942 0.203657
H  -2.456512 -1.742126 -1.457198
H  -2.212824 -0.908772 0.087859
H  -3.989558 2.724453 1.369199
H  -4.612153 3.609781 -0.045035
H  -4.368489 -3.061139 -0.439774
H  -4.095834 -2.250103 1.118171
H  2.918009 2.903795 0.181531
H  2.478281 1.921458 -1.223953
H  -1.737939 -3.193171 1.18137
H  -1.808547 -3.932379 -0.434102
H  -4.904389 -0.836399 -1.521959
H  -6.002044 -1.24579 -0.180726
H  0.124348 -1.672776 0.435245
H  0.073366 -2.372662 -1.195913
H  -4.23337 1.49999 -1.494914
H  -4.661495 0.362711 1.35292
H  3.127886 -0.196633 0.072429
H  3.606101 0.803946 1.44067
H  0.760313 -4.611565 -0.299361
H  0.682915 -3.99916 1.365691
H  6.575569 -0.073077 -0.411056
H  4.461063 -2.423627 0.107257
